BDBM50348687 CHEMBL1801049
SMILES: CC(C)Oc1ccc(Oc2ccc(cc2)S(=O)(=O)C2(CCOCC2)C(=O)NO)cc1
InChI Key: InChIKey=NUTUARVYQWFZAA-UHFFFAOYSA-N
Data: 5 IC50
Activity Spreadsheet -- Enzyme Inhibition Constant Data from BindingDB
Found 5 hits for monomerid = 50348687
Trg + Lig
Ki
nM
ΔG°
kcal/mole
IC50
nM
Kd
nM
EC50/IC50
nM
koff
s-1
kon
M-1s-1
pHTemp
°C
Matrix metalloproteinase-9
(Homo sapiens (Human))
BDBM50348687
(CHEMBL1801049)
Show SMILES CC(C)Oc1ccc(Oc2ccc(cc2)S(=O)(=O)C2(CCOCC2)C(=O)NO)cc1
Show InChI InChI=1S/C21H25NO7S/c1-15(2)28-16-3-5-17(6-4-16)29-18-7-9-19(10-8-18)30(25,26)21(20(23)22-24)11-13-27-14-12-21/h3-10,15,24H,11-14H2,1-2H3,(H,22,23)
Reactome pathway
n/an/a<0.100n/an/an/an/an/an/a
Pfizer Inc.
Curated by ChEMBL
Assay Description
Inhibition of human MMP9 assessed as cleavage of fluorogenic peptide MCAPro-Leu-Gly-Leu-Dpa-Ala-Arg-NH2 by fluorometric assay
J Med Chem 53: 6653-80 (2010)
Article DOI: 10.1021/jm100669j
BindingDB Entry DOI: 10.7270/Q2KH0NQB
Matrix metalloproteinase-14 (MMP14)
(Homo sapiens (Human))
BDBM50348687
(CHEMBL1801049)
Show SMILES CC(C)Oc1ccc(Oc2ccc(cc2)S(=O)(=O)C2(CCOCC2)C(=O)NO)cc1
Show InChI InChI=1S/C21H25NO7S/c1-15(2)28-16-3-5-17(6-4-16)29-18-7-9-19(10-8-18)30(25,26)21(20(23)22-24)11-13-27-14-12-21/h3-10,15,24H,11-14H2,1-2H3,(H,22,23)
n/an/a 11n/an/an/an/an/an/a
Pfizer Inc.
Curated by ChEMBL
Assay Description
Inhibition of human MMP14 assessed as cleavage of fluorogenic peptide MCAPro-Leu-Gly-Leu-Dpa-Ala-Arg-NH2 by fluorometric assay
J Med Chem 53: 6653-80 (2010)
Article DOI: 10.1021/jm100669j
BindingDB Entry DOI: 10.7270/Q2KH0NQB
Interstitial collagenase
(Homo sapiens (Human))
BDBM50348687
(CHEMBL1801049)
Show SMILES CC(C)Oc1ccc(Oc2ccc(cc2)S(=O)(=O)C2(CCOCC2)C(=O)NO)cc1
Show InChI InChI=1S/C21H25NO7S/c1-15(2)28-16-3-5-17(6-4-16)29-18-7-9-19(10-8-18)30(25,26)21(20(23)22-24)11-13-27-14-12-21/h3-10,15,24H,11-14H2,1-2H3,(H,22,23)
Reactome pathway
n/an/a 300n/an/an/an/an/an/a
Pfizer Inc.
Curated by ChEMBL
Assay Description
Inhibition of human MMP1 expressed in human HT-1080 cells assessed as cleavage of fluorogenic peptide MCAPro-Leu-Gly-Leu-Dpa-Ala-Arg-NH2 by fluoromet...
J Med Chem 53: 6653-80 (2010)
Article DOI: 10.1021/jm100669j
BindingDB Entry DOI: 10.7270/Q2KH0NQB
Collagenase 3
(Homo sapiens (Human))
BDBM50348687
(CHEMBL1801049)
Show SMILES CC(C)Oc1ccc(Oc2ccc(cc2)S(=O)(=O)C2(CCOCC2)C(=O)NO)cc1
Show InChI InChI=1S/C21H25NO7S/c1-15(2)28-16-3-5-17(6-4-16)29-18-7-9-19(10-8-18)30(25,26)21(20(23)22-24)11-13-27-14-12-21/h3-10,15,24H,11-14H2,1-2H3,(H,22,23)
NCI pathway
Reactome pathway
n/an/a 0.100n/an/an/an/an/an/a
Pfizer Inc.
Curated by ChEMBL
Assay Description
Inhibition of human MMP13 assessed as cleavage of fluorogenic peptide MCAPro-Leu-Gly-Leu-Dpa-Ala-Arg-NH2 by fluorometric assay
J Med Chem 53: 6653-80 (2010)
Article DOI: 10.1021/jm100669j
BindingDB Entry DOI: 10.7270/Q2KH0NQB
72 kDa type IV collagenase
(Homo sapiens (Human))
BDBM50348687
(CHEMBL1801049)
Show SMILES CC(C)Oc1ccc(Oc2ccc(cc2)S(=O)(=O)C2(CCOCC2)C(=O)NO)cc1
Show InChI InChI=1S/C21H25NO7S/c1-15(2)28-16-3-5-17(6-4-16)29-18-7-9-19(10-8-18)30(25,26)21(20(23)22-24)11-13-27-14-12-21/h3-10,15,24H,11-14H2,1-2H3,(H,22,23)
Reactome pathway
n/an/a<0.100n/an/an/an/an/an/a
Pfizer Inc.
Curated by ChEMBL
Assay Description
Inhibition of human MMP2 assessed as cleavage of fluorogenic peptide MCAPro-Leu-Gly-Leu-Dpa-Ala-Arg-NH2 by fluorometric assay
J Med Chem 53: 6653-80 (2010)
Article DOI: 10.1021/jm100669j
BindingDB Entry DOI: 10.7270/Q2KH0NQB