null
SMILES: COC(=O)c1cccc(Oc2nc[nH]c(=O)c2-c2ccccc2)c1
InChI Key: InChIKey=FRQVDWUFJNYMHD-UHFFFAOYSA-N
Activity Spreadsheet -- Enzyme Inhibition Constant Data from BindingDB
Found 3 hits for monomerid = 50348976
Trg + Lig
Ki
nM
ΔG°
kcal/mole
IC50
nM
Kd
nM
EC50/IC50
nM
koff
s-1
kon
M-1s-1
pHTemp
°C
Insulin receptor
(Homo sapiens (Human))
BDBM50348976
(CHEMBL1808225)
Show SMILES COC(=O)c1cccc(Oc2nc[nH]c(=O)c2-c2ccccc2)c1
Show InChI InChI=1S/C18H14N2O4/c1-23-18(22)13-8-5-9-14(10-13)24-17-15(16(21)19-11-20-17)12-6-3-2-4-7-12/h2-11H,1H3,(H,19,20,21)
n/an/a>4.00E+4n/an/an/an/an/an/a
St. Jude Children's Research Hospital
Curated by ChEMBL
Assay Description
Inhibition of recombinant IRK using biotinylated-poly(GT) peptide as substrate after 60 mins
Bioorg Med Chem Lett 21: 4592-6 (2011)
Article DOI: 10.1016/j.bmcl.2011.05.103
BindingDB Entry DOI: 10.7270/Q2N87B4V
Hepatocyte growth factor receptor
(Homo sapiens (Human))
BDBM50348976
(CHEMBL1808225)
Show SMILES COC(=O)c1cccc(Oc2nc[nH]c(=O)c2-c2ccccc2)c1
Show InChI InChI=1S/C18H14N2O4/c1-23-18(22)13-8-5-9-14(10-13)24-17-15(16(21)19-11-20-17)12-6-3-2-4-7-12/h2-11H,1H3,(H,19,20,21)
n/an/a>4.00E+4n/an/an/an/an/an/a
St. Jude Children's Research Hospital
Curated by ChEMBL
Assay Description
Inhibition of recombinant MET using biotinylated-poly(GT) peptide as substrate after 60 mins
Bioorg Med Chem Lett 21: 4592-6 (2011)
Article DOI: 10.1016/j.bmcl.2011.05.103
BindingDB Entry DOI: 10.7270/Q2N87B4V
ALK tyrosine kinase receptor
(Homo sapiens (Human))
BDBM50348976
(CHEMBL1808225)
Show SMILES COC(=O)c1cccc(Oc2nc[nH]c(=O)c2-c2ccccc2)c1
Show InChI InChI=1S/C18H14N2O4/c1-23-18(22)13-8-5-9-14(10-13)24-17-15(16(21)19-11-20-17)12-6-3-2-4-7-12/h2-11H,1H3,(H,19,20,21)
n/an/a>4.00E+4n/an/an/an/an/an/a
St. Jude Children's Research Hospital
Curated by ChEMBL
Assay Description
Inhibition of 6xHis-tagged NPM-ALK using biotinylated-poly(GT) peptide as substrate after 60 mins
Bioorg Med Chem Lett 21: 4592-6 (2011)
Article DOI: 10.1016/j.bmcl.2011.05.103
BindingDB Entry DOI: 10.7270/Q2N87B4V