BDBM50349030 CHEMBL1807804
SMILES: C[C@H](N)C(=O)N1CCc2c(C)c3c(CC(C)(C)CC3=O)n2-c2ccc(C(N)=O)c(N[C@@H](C)[C@H](C)C1)c2
InChI Key: InChIKey=JSSUIPOIXFFFQU-NJAFHUGGSA-N
Data: 2 IC50
PDB links: 1 PDB ID matches this monomer.
Activity Spreadsheet -- Enzyme Inhibition Constant Data from BindingDB
Found 2 hits for monomerid = 50349030
Trg + Lig
Ki
nM
ΔG°
kcal/mole
IC50
nM
Kd
nM
EC50/IC50
nM
koff
s-1
kon
M-1s-1
pHTemp
°C
Heat shock protein HSP 90-alpha
(Homo sapiens (Human))
BDBM50349030
(CHEMBL1807804)
Show SMILES C[C@H](N)C(=O)N1CCc2c(C)c3c(CC(C)(C)CC3=O)n2-c2ccc(C(N)=O)c(N[C@@H](C)[C@H](C)C1)c2 |r|
Show InChI InChI=1S/C28H39N5O3/c1-15-14-32(27(36)17(3)29)10-9-22-16(2)25-23(12-28(5,6)13-24(25)34)33(22)19-7-8-20(26(30)35)21(11-19)31-18(15)4/h7-8,11,15,17-18,31H,9-10,12-14,29H2,1-6H3,(H2,30,35)/t15-,17+,18+/m1/s1
NCI pathway
Reactome pathway
n/an/a 83n/an/an/an/an/an/a
Pfizer Inc.
Curated by ChEMBL
Assay Description
Binding affinity to HSP90alpha after 3 hrs by fluorescence polarization assay
Bioorg Med Chem Lett 21: 4602-7 (2011)
Article DOI: 10.1016/j.bmcl.2011.05.102
BindingDB Entry DOI: 10.7270/Q2833SD5
3D
3D Structure (crystal)
Potassium voltage-gated channel subfamily H member 2
(Homo sapiens (Human))
BDBM50349030
(CHEMBL1807804)
Show SMILES C[C@H](N)C(=O)N1CCc2c(C)c3c(CC(C)(C)CC3=O)n2-c2ccc(C(N)=O)c(N[C@@H](C)[C@H](C)C1)c2 |r|
Show InChI InChI=1S/C28H39N5O3/c1-15-14-32(27(36)17(3)29)10-9-22-16(2)25-23(12-28(5,6)13-24(25)34)33(22)19-7-8-20(26(30)35)21(11-19)31-18(15)4/h7-8,11,15,17-18,31H,9-10,12-14,29H2,1-6H3,(H2,30,35)/t15-,17+,18+/m1/s1
Reactome pathway
n/an/a>3.30E+4n/an/an/an/an/an/a
Pfizer Inc.
Curated by ChEMBL
Assay Description
Inhibition of human ERG
Bioorg Med Chem Lett 21: 4602-7 (2011)
Article DOI: 10.1016/j.bmcl.2011.05.102
BindingDB Entry DOI: 10.7270/Q2833SD5