null
SMILES: C[C@@H]1Nc2cc(ccc2C(N)=O)-n2c3CC(C)(C)CC(=O)c3c(C)c2CCCN([C@H]1C)C(=O)CO
InChI Key: InChIKey=GUYAKTTZJAARFK-IRXDYDNUSA-N
Activity Spreadsheet -- Enzyme Inhibition Constant Data from BindingDB
Found 1 hit for monomerid = 50349041
Trg + Lig
Ki
nM
ΔG°
kcal/mole
IC50
nM
Kd
nM
EC50/IC50
nM
koff
s-1
kon
M-1s-1
pHTemp
°C
Heat shock protein HSP 90-alpha
(Homo sapiens (Human))
BDBM50349041
(CHEMBL1807800)
Show SMILES C[C@@H]1Nc2cc(ccc2C(N)=O)-n2c3CC(C)(C)CC(=O)c3c(C)c2CCCN([C@H]1C)C(=O)CO |r|
Show InChI InChI=1S/C27H36N4O4/c1-15-21-7-6-10-30(24(34)14-32)17(3)16(2)29-20-11-18(8-9-19(20)26(28)35)31(21)22-12-27(4,5)13-23(33)25(15)22/h8-9,11,16-17,29,32H,6-7,10,12-14H2,1-5H3,(H2,28,35)/t16-,17-/m0/s1
NCI pathway
Reactome pathway
n/an/a 77n/an/an/an/an/an/a
Pfizer Inc.
Curated by ChEMBL
Assay Description
Binding affinity to HSP90alpha after 3 hrs by fluorescence polarization assay
Bioorg Med Chem Lett 21: 4602-7 (2011)
Article DOI: 10.1016/j.bmcl.2011.05.102
BindingDB Entry DOI: 10.7270/Q2833SD5