null
SMILES: C[C@@H]1CN(CCc2c(C)c3c(CC(C)(C)CC3=O)n2-c2ccc(C(N)=O)c(N[C@H]1C)c2)C(=O)[C@@H]1CCCN1
InChI Key: InChIKey=KRHCYUXPGWYNDE-LZNRXBQRSA-N
Activity Spreadsheet -- Enzyme Inhibition Constant Data from BindingDB
Found 1 hit for monomerid = 50349050
Trg + Lig
Ki
nM
ΔG°
kcal/mole
IC50
nM
Kd
nM
EC50/IC50
nM
koff
s-1
kon
M-1s-1
pHTemp
°C
Heat shock protein HSP 90-alpha
(Homo sapiens (Human))
BDBM50349050
(CHEMBL1807810)
Show SMILES C[C@@H]1CN(CCc2c(C)c3c(CC(C)(C)CC3=O)n2-c2ccc(C(N)=O)c(N[C@H]1C)c2)C(=O)[C@@H]1CCCN1 |r|
Show InChI InChI=1S/C30H41N5O3/c1-17-16-34(29(38)22-7-6-11-32-22)12-10-24-18(2)27-25(14-30(4,5)15-26(27)36)35(24)20-8-9-21(28(31)37)23(13-20)33-19(17)3/h8-9,13,17,19,22,32-33H,6-7,10-12,14-16H2,1-5H3,(H2,31,37)/t17-,19+,22+/m1/s1
NCI pathway
Reactome pathway
n/an/a 68n/an/an/an/an/an/a
Pfizer Inc.
Curated by ChEMBL
Assay Description
Binding affinity to HSP90alpha after 3 hrs by fluorescence polarization assay
Bioorg Med Chem Lett 21: 4602-7 (2011)
Article DOI: 10.1016/j.bmcl.2011.05.102
BindingDB Entry DOI: 10.7270/Q2833SD5