BDBM50349092 CHEMBL1807303
SMILES: CCc1cccc(CC)c1NC(=O)c1nn(C)c-2c1CCc1cnc(Nc3ccc(cc3OC)C(=O)N3CCC(CC3)N(C)C)nc-21
InChI Key: InChIKey=COJCXGYVLBGQIH-UHFFFAOYSA-N
Data: 4 IC50
Activity Spreadsheet -- Enzyme Inhibition Constant Data from BindingDB
Found 4 hits for monomerid = 50349092
Trg + Lig
Ki
nM
ΔG°
kcal/mole
IC50
nM
Kd
nM
EC50/IC50
nM
koff
s-1
kon
M-1s-1
pHTemp
°C
Serine/threonine-protein kinase PLK1
(Homo sapiens (Human))
BDBM50349092
(CHEMBL1807303)
Show SMILES CCc1cccc(CC)c1NC(=O)c1nn(C)c-2c1CCc1cnc(Nc3ccc(cc3OC)C(=O)N3CCC(CC3)N(C)C)nc-21
Show InChI InChI=1S/C36H44N8O3/c1-7-22-10-9-11-23(8-2)30(22)39-34(45)32-27-14-12-25-21-37-36(40-31(25)33(27)43(5)41-32)38-28-15-13-24(20-29(28)47-6)35(46)44-18-16-26(17-19-44)42(3)4/h9-11,13,15,20-21,26H,7-8,12,14,16-19H2,1-6H3,(H,39,45)(H,37,38,40)
NCI pathway
Reactome pathway
n/an/a>1.00E+4n/an/an/an/an/an/a
Nerviano Medical Sciences srl
Curated by ChEMBL
Assay Description
Inhibition of PLK1 assessed as [33P]-gamma-ATP incorporation into substrate by gamma counting
Bioorg Med Chem Lett 21: 4507-11 (2011)
Article DOI: 10.1016/j.bmcl.2011.05.122
BindingDB Entry DOI: 10.7270/Q2R211RS
Cyclin-Dependent Kinase 2 (CDK2)
(Homo sapiens (Human))
BDBM50349092
(CHEMBL1807303)
Show SMILES CCc1cccc(CC)c1NC(=O)c1nn(C)c-2c1CCc1cnc(Nc3ccc(cc3OC)C(=O)N3CCC(CC3)N(C)C)nc-21
Show InChI InChI=1S/C36H44N8O3/c1-7-22-10-9-11-23(8-2)30(22)39-34(45)32-27-14-12-25-21-37-36(40-31(25)33(27)43(5)41-32)38-28-15-13-24(20-29(28)47-6)35(46)44-18-16-26(17-19-44)42(3)4/h9-11,13,15,20-21,26H,7-8,12,14,16-19H2,1-6H3,(H,39,45)(H,37,38,40)
NCI pathway
Reactome pathway
n/an/a>1.00E+4n/an/an/an/an/an/a
Nerviano Medical Sciences srl
Curated by ChEMBL
Assay Description
Inhibition of CDK2/Cyclin A assessed as [33P]-gamma-ATP incorporation into substrate by gamma counting
Bioorg Med Chem Lett 21: 4507-11 (2011)
Article DOI: 10.1016/j.bmcl.2011.05.122
BindingDB Entry DOI: 10.7270/Q2R211RS
Aurora kinase A
(Homo sapiens (Human))
BDBM50349092
(CHEMBL1807303)
Show SMILES CCc1cccc(CC)c1NC(=O)c1nn(C)c-2c1CCc1cnc(Nc3ccc(cc3OC)C(=O)N3CCC(CC3)N(C)C)nc-21
Show InChI InChI=1S/C36H44N8O3/c1-7-22-10-9-11-23(8-2)30(22)39-34(45)32-27-14-12-25-21-37-36(40-31(25)33(27)43(5)41-32)38-28-15-13-24(20-29(28)47-6)35(46)44-18-16-26(17-19-44)42(3)4/h9-11,13,15,20-21,26H,7-8,12,14,16-19H2,1-6H3,(H,39,45)(H,37,38,40)
NCI pathway
Reactome pathway
n/an/a 484n/an/an/an/an/an/a
Nerviano Medical Sciences srl
Curated by ChEMBL
Assay Description
Inhibition of Aur-A assessed as [33P]-gamma-ATP incorporation into substrate by gamma counting
Bioorg Med Chem Lett 21: 4507-11 (2011)
Article DOI: 10.1016/j.bmcl.2011.05.122
BindingDB Entry DOI: 10.7270/Q2R211RS
Dual specificity protein kinase TTK
(Homo sapiens (Human))
BDBM50349092
(CHEMBL1807303)
Show SMILES CCc1cccc(CC)c1NC(=O)c1nn(C)c-2c1CCc1cnc(Nc3ccc(cc3OC)C(=O)N3CCC(CC3)N(C)C)nc-21
Show InChI InChI=1S/C36H44N8O3/c1-7-22-10-9-11-23(8-2)30(22)39-34(45)32-27-14-12-25-21-37-36(40-31(25)33(27)43(5)41-32)38-28-15-13-24(20-29(28)47-6)35(46)44-18-16-26(17-19-44)42(3)4/h9-11,13,15,20-21,26H,7-8,12,14,16-19H2,1-6H3,(H,39,45)(H,37,38,40)
n/an/a 19n/an/an/an/an/an/a
Nerviano Medical Sciences srl
Curated by ChEMBL
Assay Description
Inhibition of MPS1 assessed as [33P]-gamma-ATP incorporation into substrate P38-betatide by gamma counting
Bioorg Med Chem Lett 21: 4507-11 (2011)
Article DOI: 10.1016/j.bmcl.2011.05.122
BindingDB Entry DOI: 10.7270/Q2R211RS