null
SMILES: Cn1nc(C(=O)NCCc2ccccc2)c2CCc3cnc(Nc4ccccc4)nc3-c12
InChI Key: InChIKey=AOWRNBGAGSLHKJ-UHFFFAOYSA-N
Activity Spreadsheet -- Enzyme Inhibition Constant Data from BindingDB
Found 4 hits for monomerid = 50349107
Trg + Lig
Ki
nM
ΔG°
kcal/mole
IC50
nM
Kd
nM
EC50/IC50
nM
koff
s-1
kon
M-1s-1
pHTemp
°C
Aurora kinase A
(Homo sapiens (Human))
BDBM50349107
(CHEMBL1808335)
Show SMILES Cn1nc(C(=O)NCCc2ccccc2)c2CCc3cnc(Nc4ccccc4)nc3-c12
Show InChI InChI=1S/C25H24N6O/c1-31-23-20(22(30-31)24(32)26-15-14-17-8-4-2-5-9-17)13-12-18-16-27-25(29-21(18)23)28-19-10-6-3-7-11-19/h2-11,16H,12-15H2,1H3,(H,26,32)(H,27,28,29)
NCI pathway
Reactome pathway
n/an/a 677n/an/an/an/an/an/a
Nerviano Medical Sciences srl
Curated by ChEMBL
Assay Description
Inhibition of Aur-A assessed as [33P]-gamma-ATP incorporation into substrate by gamma counting
Bioorg Med Chem Lett 21: 4507-11 (2011)
Article DOI: 10.1016/j.bmcl.2011.05.122
BindingDB Entry DOI: 10.7270/Q2R211RS
Serine/threonine-protein kinase PLK1
(Homo sapiens (Human))
BDBM50349107
(CHEMBL1808335)
Show SMILES Cn1nc(C(=O)NCCc2ccccc2)c2CCc3cnc(Nc4ccccc4)nc3-c12
Show InChI InChI=1S/C25H24N6O/c1-31-23-20(22(30-31)24(32)26-15-14-17-8-4-2-5-9-17)13-12-18-16-27-25(29-21(18)23)28-19-10-6-3-7-11-19/h2-11,16H,12-15H2,1H3,(H,26,32)(H,27,28,29)
NCI pathway
Reactome pathway
n/an/a>1.00E+4n/an/an/an/an/an/a
Nerviano Medical Sciences srl
Curated by ChEMBL
Assay Description
Inhibition of PLK1 assessed as [33P]-gamma-ATP incorporation into substrate by gamma counting
Bioorg Med Chem Lett 21: 4507-11 (2011)
Article DOI: 10.1016/j.bmcl.2011.05.122
BindingDB Entry DOI: 10.7270/Q2R211RS
Dual specificity protein kinase TTK
(Homo sapiens (Human))
BDBM50349107
(CHEMBL1808335)
Show SMILES Cn1nc(C(=O)NCCc2ccccc2)c2CCc3cnc(Nc4ccccc4)nc3-c12
Show InChI InChI=1S/C25H24N6O/c1-31-23-20(22(30-31)24(32)26-15-14-17-8-4-2-5-9-17)13-12-18-16-27-25(29-21(18)23)28-19-10-6-3-7-11-19/h2-11,16H,12-15H2,1H3,(H,26,32)(H,27,28,29)
n/an/a>1.20E+4n/an/an/an/an/an/a
Nerviano Medical Sciences srl
Curated by ChEMBL
Assay Description
Inhibition of MPS1 assessed as [33P]-gamma-ATP incorporation into substrate P38-betatide by gamma counting
Bioorg Med Chem Lett 21: 4507-11 (2011)
Article DOI: 10.1016/j.bmcl.2011.05.122
BindingDB Entry DOI: 10.7270/Q2R211RS
Cyclin-A2/Cyclin-dependent kinase 2
(Homo sapiens (Human))
BDBM50349107
(CHEMBL1808335)
Show SMILES Cn1nc(C(=O)NCCc2ccccc2)c2CCc3cnc(Nc4ccccc4)nc3-c12
Show InChI InChI=1S/C25H24N6O/c1-31-23-20(22(30-31)24(32)26-15-14-17-8-4-2-5-9-17)13-12-18-16-27-25(29-21(18)23)28-19-10-6-3-7-11-19/h2-11,16H,12-15H2,1H3,(H,26,32)(H,27,28,29)
NCI pathway
Reactome pathway
n/an/a 697n/an/an/an/an/an/a
Nerviano Medical Sciences srl
Curated by ChEMBL
Assay Description
Inhibition of CDK2/Cyclin A assessed as [33P]-gamma-ATP incorporation into substrate by gamma counting
Bioorg Med Chem Lett 21: 4507-11 (2011)
Article DOI: 10.1016/j.bmcl.2011.05.122
BindingDB Entry DOI: 10.7270/Q2R211RS