BDBM50349187 CHEMBL1807528
SMILES: OC(=O)CCn1c2ccccc2n(Cc2nsc3ccccc23)c1=O
InChI Key: InChIKey=UWTUPAGKZAKECK-UHFFFAOYSA-N
Data: 2 IC50
Activity Spreadsheet -- Enzyme Inhibition Constant Data from BindingDB
Found 2 hits for monomerid = 50349187
Trg + Lig
Ki
nM
ΔG°
kcal/mole
IC50
nM
Kd
nM
EC50/IC50
nM
koff
s-1
kon
M-1s-1
pHTemp
°C
Cathepsin G
(Homo sapiens (Human))
BDBM50349187
(CHEMBL1807528)
Show SMILES OC(=O)CCn1c2ccccc2n(Cc2nsc3ccccc23)c1=O
Show InChI InChI=1S/C18H15N3O3S/c22-17(23)9-10-20-14-6-2-3-7-15(14)21(18(20)24)11-13-12-5-1-4-8-16(12)25-19-13/h1-8H,9-11H2,(H,22,23)
NCI pathway
Reactome pathway
n/an/a>10n/an/an/an/an/an/a
Boehringer Ingelheim Pharmaceuticals Inc.
Curated by ChEMBL
Assay Description
Inhibition of human cathepsin G after 1 hr by fluorometric assay
Bioorg Med Chem Lett 21: 4533-9 (2011)
Article DOI: 10.1016/j.bmcl.2011.05.126
BindingDB Entry DOI: 10.7270/Q23B60H0
Chymase
(Homo sapiens (Human))
BDBM50349187
(CHEMBL1807528)
Show SMILES OC(=O)CCn1c2ccccc2n(Cc2nsc3ccccc23)c1=O
Show InChI InChI=1S/C18H15N3O3S/c22-17(23)9-10-20-14-6-2-3-7-15(14)21(18(20)24)11-13-12-5-1-4-8-16(12)25-19-13/h1-8H,9-11H2,(H,22,23)
Reactome pathway
n/an/a 4.20E+3n/an/an/an/an/an/a
Boehringer Ingelheim Pharmaceuticals Inc.
Curated by ChEMBL
Assay Description
Inhibition of human chymase after 1 hr by fluorometric assay
Bioorg Med Chem Lett 21: 4533-9 (2011)
Article DOI: 10.1016/j.bmcl.2011.05.126
BindingDB Entry DOI: 10.7270/Q23B60H0