BDBM50349195 CHEMBL1807645
SMILES: C[C@@H]1CC[C@H](NC(=O)[C@H](CC2=CCCC2)NC(=O)c2ccco2)C(=O)CN1S(=O)(=O)c1ccccn1
InChI Key: InChIKey=VJBNYTFCTIYDMG-HOJAQTOUSA-N
Data: 3 IC50
Activity Spreadsheet -- Enzyme Inhibition Constant Data from BindingDB
Found 3 hits for monomerid = 50349195
Trg + Lig
Ki
nM
ΔG°
kcal/mole
IC50
nM
Kd
nM
EC50/IC50
nM
koff
s-1
kon
M-1s-1
pHTemp
°C
Cathepsin S
(Homo sapiens (Human))
BDBM50349195
(CHEMBL1807645)
Show SMILES C[C@@H]1CC[C@H](NC(=O)[C@H](CC2=CCCC2)NC(=O)c2ccco2)C(=O)CN1S(=O)(=O)c1ccccn1 |r,t:10|
Show InChI InChI=1S/C25H30N4O6S/c1-17-11-12-19(21(30)16-29(17)36(33,34)23-10-4-5-13-26-23)27-24(31)20(15-18-7-2-3-8-18)28-25(32)22-9-6-14-35-22/h4-7,9-10,13-14,17,19-20H,2-3,8,11-12,15-16H2,1H3,(H,27,31)(H,28,32)/t17-,19+,20+/m1/s1
Reactome pathway
n/an/a 4.90n/an/an/an/an/an/a
GlaxoSmithKline
Curated by ChEMBL
Assay Description
Inhibition of human recombinant cathepsin S using Ac-KQLR-AMC as substrate by fluorescence assay
Bioorg Med Chem Lett 21: 4409-15 (2011)
Article DOI: 10.1016/j.bmcl.2011.06.045
BindingDB Entry DOI: 10.7270/Q2TT4R90
Procathepsin L
(Homo sapiens (Human))
BDBM50349195
(CHEMBL1807645)
Show SMILES C[C@@H]1CC[C@H](NC(=O)[C@H](CC2=CCCC2)NC(=O)c2ccco2)C(=O)CN1S(=O)(=O)c1ccccn1 |r,t:10|
Show InChI InChI=1S/C25H30N4O6S/c1-17-11-12-19(21(30)16-29(17)36(33,34)23-10-4-5-13-26-23)27-24(31)20(15-18-7-2-3-8-18)28-25(32)22-9-6-14-35-22/h4-7,9-10,13-14,17,19-20H,2-3,8,11-12,15-16H2,1H3,(H,27,31)(H,28,32)/t17-,19+,20+/m1/s1
Reactome pathway
n/an/a 3.80n/an/an/an/an/an/a
GlaxoSmithKline
Curated by ChEMBL
Assay Description
Inhibition of human recombinant cathepsin L using Z-LR-AMC as substrate by fluorescence assay
Bioorg Med Chem Lett 21: 4409-15 (2011)
Article DOI: 10.1016/j.bmcl.2011.06.045
BindingDB Entry DOI: 10.7270/Q2TT4R90
Cathepsin K
(Homo sapiens (Human))
BDBM50349195
(CHEMBL1807645)
Show SMILES C[C@@H]1CC[C@H](NC(=O)[C@H](CC2=CCCC2)NC(=O)c2ccco2)C(=O)CN1S(=O)(=O)c1ccccn1 |r,t:10|
Show InChI InChI=1S/C25H30N4O6S/c1-17-11-12-19(21(30)16-29(17)36(33,34)23-10-4-5-13-26-23)27-24(31)20(15-18-7-2-3-8-18)28-25(32)22-9-6-14-35-22/h4-7,9-10,13-14,17,19-20H,2-3,8,11-12,15-16H2,1H3,(H,27,31)(H,28,32)/t17-,19+,20+/m1/s1
Reactome pathway
n/an/a 9n/an/an/an/an/an/a
GlaxoSmithKline
Curated by ChEMBL
Assay Description
Inhibition of human recombinant cathepsin K using z-LR-AFC as substrate by fluorescence assay
Bioorg Med Chem Lett 21: 4409-15 (2011)
Article DOI: 10.1016/j.bmcl.2011.06.045
BindingDB Entry DOI: 10.7270/Q2TT4R90