BDBM50349202 CHEMBL1807697
SMILES: C[C@@H]1CC[C@H](NC(=O)[C@H](CCC2CCCC2)NC(=O)c2ccco2)C(=O)CN1S(=O)(=O)c1ccccn1
InChI Key: InChIKey=ROFMAUJRSYVSKK-GIVPXCGWSA-N
Data: 3 IC50
Activity Spreadsheet -- Enzyme Inhibition Constant Data from BindingDB
Found 3 hits for monomerid = 50349202
Trg + Lig
Ki
nM
ΔG°
kcal/mole
IC50
nM
Kd
nM
EC50/IC50
nM
koff
s-1
kon
M-1s-1
pHTemp
°C
Cathepsin S
(Homo sapiens (Human))
BDBM50349202
(CHEMBL1807697)
Show SMILES C[C@@H]1CC[C@H](NC(=O)[C@H](CCC2CCCC2)NC(=O)c2ccco2)C(=O)CN1S(=O)(=O)c1ccccn1 |r|
Show InChI InChI=1S/C26H34N4O6S/c1-18-11-13-20(22(31)17-30(18)37(34,35)24-10-4-5-15-27-24)28-25(32)21(14-12-19-7-2-3-8-19)29-26(33)23-9-6-16-36-23/h4-6,9-10,15-16,18-21H,2-3,7-8,11-14,17H2,1H3,(H,28,32)(H,29,33)/t18-,20+,21+/m1/s1
Reactome pathway
n/an/a 1.90n/an/an/an/an/an/a
GlaxoSmithKline
Curated by ChEMBL
Assay Description
Inhibition of human recombinant cathepsin S using Ac-KQLR-AMC as substrate by fluorescence assay
Bioorg Med Chem Lett 21: 4409-15 (2011)
Article DOI: 10.1016/j.bmcl.2011.06.045
BindingDB Entry DOI: 10.7270/Q2TT4R90
Procathepsin L
(Homo sapiens (Human))
BDBM50349202
(CHEMBL1807697)
Show SMILES C[C@@H]1CC[C@H](NC(=O)[C@H](CCC2CCCC2)NC(=O)c2ccco2)C(=O)CN1S(=O)(=O)c1ccccn1 |r|
Show InChI InChI=1S/C26H34N4O6S/c1-18-11-13-20(22(31)17-30(18)37(34,35)24-10-4-5-15-27-24)28-25(32)21(14-12-19-7-2-3-8-19)29-26(33)23-9-6-16-36-23/h4-6,9-10,15-16,18-21H,2-3,7-8,11-14,17H2,1H3,(H,28,32)(H,29,33)/t18-,20+,21+/m1/s1
Reactome pathway
n/an/a 10.7n/an/an/an/an/an/a
GlaxoSmithKline
Curated by ChEMBL
Assay Description
Inhibition of human recombinant cathepsin L using Z-LR-AMC as substrate by fluorescence assay
Bioorg Med Chem Lett 21: 4409-15 (2011)
Article DOI: 10.1016/j.bmcl.2011.06.045
BindingDB Entry DOI: 10.7270/Q2TT4R90
Cathepsin K
(Homo sapiens (Human))
BDBM50349202
(CHEMBL1807697)
Show SMILES C[C@@H]1CC[C@H](NC(=O)[C@H](CCC2CCCC2)NC(=O)c2ccco2)C(=O)CN1S(=O)(=O)c1ccccn1 |r|
Show InChI InChI=1S/C26H34N4O6S/c1-18-11-13-20(22(31)17-30(18)37(34,35)24-10-4-5-15-27-24)28-25(32)21(14-12-19-7-2-3-8-19)29-26(33)23-9-6-16-36-23/h4-6,9-10,15-16,18-21H,2-3,7-8,11-14,17H2,1H3,(H,28,32)(H,29,33)/t18-,20+,21+/m1/s1
Reactome pathway
n/an/a 840n/an/an/an/an/an/a
GlaxoSmithKline
Curated by ChEMBL
Assay Description
Inhibition of human recombinant cathepsin K using z-LR-AFC as substrate by fluorescence assay
Bioorg Med Chem Lett 21: 4409-15 (2011)
Article DOI: 10.1016/j.bmcl.2011.06.045
BindingDB Entry DOI: 10.7270/Q2TT4R90