BDBM50349539 CHEMBL1808870
SMILES: Clc1cccc(c1)-c1ccc(cn1)C1CCCN1C(=O)c1cnccn1
InChI Key: InChIKey=VUTGVPBYFVEYNJ-UHFFFAOYSA-N
Data: 1 KI  1 IC50
Activity Spreadsheet -- Enzyme Inhibition Constant Data from BindingDB
Found 2 hits for monomerid = 50349539
Trg + Lig
Ki
nM
ΔG°
kcal/mole
IC50
nM
Kd
nM
EC50/IC50
nM
koff
s-1
kon
M-1s-1
pHTemp
°C
Metabotropic glutamate receptor 5
(Homo sapiens (Human))
BDBM50349539
(CHEMBL1808870)
Show SMILES Clc1cccc(c1)-c1ccc(cn1)C1CCCN1C(=O)c1cnccn1
Show InChI InChI=1S/C20H17ClN4O/c21-16-4-1-3-14(11-16)17-7-6-15(12-24-17)19-5-2-10-25(19)20(26)18-13-22-8-9-23-18/h1,3-4,6-9,11-13,19H,2,5,10H2
540n/an/an/an/an/an/an/an/a
Lundbeck Research USA, Inc.
Curated by ChEMBL
Assay Description
Displacement of [3H]-MPEP from human mGluR5 expressed in CHO cells after 60 mins
Bioorg Med Chem Lett 21: 4891-9 (2011)
Article DOI: 10.1016/j.bmcl.2011.06.014
BindingDB Entry DOI: 10.7270/Q2CN748G
Metabotropic glutamate receptor 5
(Homo sapiens (Human))
BDBM50349539
(CHEMBL1808870)
Show SMILES Clc1cccc(c1)-c1ccc(cn1)C1CCCN1C(=O)c1cnccn1
Show InChI InChI=1S/C20H17ClN4O/c21-16-4-1-3-14(11-16)17-7-6-15(12-24-17)19-5-2-10-25(19)20(26)18-13-22-8-9-23-18/h1,3-4,6-9,11-13,19H,2,5,10H2
n/an/a 74n/an/an/an/an/an/a
Lundbeck Research USA, Inc.
Curated by ChEMBL
Assay Description
Negative allosteric modulation of human mGlu5 receptor expressed in HEK293 cells assessed as inhibition of glutamate-induced calcium mobilization aft...
Bioorg Med Chem Lett 21: 4891-9 (2011)
Article DOI: 10.1016/j.bmcl.2011.06.014
BindingDB Entry DOI: 10.7270/Q2CN748G