BDBM50349547 CHEMBL1808898
SMILES: Cc1cc(ncc1C1CC(O)CN1C(=O)c1cnccn1)-c1cccc(Cl)c1
InChI Key: InChIKey=IKTDDYJJPQAFAC-UHFFFAOYSA-N
Data: 1 KI  1 IC50
Activity Spreadsheet -- Enzyme Inhibition Constant Data from BindingDB
Found 2 hits for monomerid = 50349547
Trg + Lig
Ki
nM
ΔG°
kcal/mole
IC50
nM
Kd
nM
EC50/IC50
nM
koff
s-1
kon
M-1s-1
pHTemp
°C
Metabotropic glutamate receptor 5
(Homo sapiens (Human))
BDBM50349547
(CHEMBL1808898)
Show SMILES Cc1cc(ncc1C1CC(O)CN1C(=O)c1cnccn1)-c1cccc(Cl)c1
Show InChI InChI=1S/C21H19ClN4O2/c1-13-7-18(14-3-2-4-15(22)8-14)25-10-17(13)20-9-16(27)12-26(20)21(28)19-11-23-5-6-24-19/h2-8,10-11,16,20,27H,9,12H2,1H3
3.00E+3n/an/an/an/an/an/an/an/a
Lundbeck Research USA, Inc.
Curated by ChEMBL
Assay Description
Displacement of [3H]-MPEP from human mGluR5 expressed in CHO cells after 60 mins
Bioorg Med Chem Lett 21: 4891-9 (2011)
Article DOI: 10.1016/j.bmcl.2011.06.014
BindingDB Entry DOI: 10.7270/Q2CN748G
Metabotropic glutamate receptor 5
(Homo sapiens (Human))
BDBM50349547
(CHEMBL1808898)
Show SMILES Cc1cc(ncc1C1CC(O)CN1C(=O)c1cnccn1)-c1cccc(Cl)c1
Show InChI InChI=1S/C21H19ClN4O2/c1-13-7-18(14-3-2-4-15(22)8-14)25-10-17(13)20-9-16(27)12-26(20)21(28)19-11-23-5-6-24-19/h2-8,10-11,16,20,27H,9,12H2,1H3
n/an/a 320n/an/an/an/an/an/a
Lundbeck Research USA, Inc.
Curated by ChEMBL
Assay Description
Negative allosteric modulation of human mGlu5 receptor expressed in HEK293 cells assessed as inhibition of glutamate-induced calcium mobilization aft...
Bioorg Med Chem Lett 21: 4891-9 (2011)
Article DOI: 10.1016/j.bmcl.2011.06.014
BindingDB Entry DOI: 10.7270/Q2CN748G