BDBM50349548 CHEMBL1808897
SMILES: Cc1cc(ncc1C1CC(O)CN1C(=O)C1CCC1)-c1cccc(Cl)c1
InChI Key: InChIKey=SSFZWHHWBFSYKR-UHFFFAOYSA-N
Data: 1 KI  1 IC50
Activity Spreadsheet -- Enzyme Inhibition Constant Data from BindingDB
Found 2 hits for monomerid = 50349548
Trg + Lig
Ki
nM
ΔG°
kcal/mole
IC50
nM
Kd
nM
EC50/IC50
nM
koff
s-1
kon
M-1s-1
pHTemp
°C
Metabotropic glutamate receptor 5
(Homo sapiens (Human))
BDBM50349548
(CHEMBL1808897)
Show SMILES Cc1cc(ncc1C1CC(O)CN1C(=O)C1CCC1)-c1cccc(Cl)c1
Show InChI InChI=1S/C21H23ClN2O2/c1-13-8-19(15-6-3-7-16(22)9-15)23-11-18(13)20-10-17(25)12-24(20)21(26)14-4-2-5-14/h3,6-9,11,14,17,20,25H,2,4-5,10,12H2,1H3
570n/an/an/an/an/an/an/an/a
Lundbeck Research USA, Inc.
Curated by ChEMBL
Assay Description
Displacement of [3H]-MPEP from human mGluR5 expressed in CHO cells after 60 mins
Bioorg Med Chem Lett 21: 4891-9 (2011)
Article DOI: 10.1016/j.bmcl.2011.06.014
BindingDB Entry DOI: 10.7270/Q2CN748G
Metabotropic glutamate receptor 5
(Homo sapiens (Human))
BDBM50349548
(CHEMBL1808897)
Show SMILES Cc1cc(ncc1C1CC(O)CN1C(=O)C1CCC1)-c1cccc(Cl)c1
Show InChI InChI=1S/C21H23ClN2O2/c1-13-8-19(15-6-3-7-16(22)9-15)23-11-18(13)20-10-17(25)12-24(20)21(26)14-4-2-5-14/h3,6-9,11,14,17,20,25H,2,4-5,10,12H2,1H3
n/an/a 320n/an/an/an/an/an/a
Lundbeck Research USA, Inc.
Curated by ChEMBL
Assay Description
Negative allosteric modulation of human mGlu5 receptor expressed in HEK293 cells assessed as inhibition of glutamate-induced calcium mobilization aft...
Bioorg Med Chem Lett 21: 4891-9 (2011)
Article DOI: 10.1016/j.bmcl.2011.06.014
BindingDB Entry DOI: 10.7270/Q2CN748G