BDBM50349567 CHEMBL1808877
SMILES: Cc1cc(ncc1C1CCCN1C(=O)c1cncnc1)-c1cccc(Cl)c1
InChI Key: InChIKey=JRHLVCCOBYWPEE-UHFFFAOYSA-N
Data: 1 KI  1 IC50
Activity Spreadsheet -- Enzyme Inhibition Constant Data from BindingDB
Found 2 hits for monomerid = 50349567
Trg + Lig
Ki
nM
ΔG°
kcal/mole
IC50
nM
Kd
nM
EC50/IC50
nM
koff
s-1
kon
M-1s-1
pHTemp
°C
Metabotropic glutamate receptor 5
(Homo sapiens (Human))
BDBM50349567
(CHEMBL1808877)
Show SMILES Cc1cc(ncc1C1CCCN1C(=O)c1cncnc1)-c1cccc(Cl)c1
Show InChI InChI=1S/C21H19ClN4O/c1-14-8-19(15-4-2-5-17(22)9-15)25-12-18(14)20-6-3-7-26(20)21(27)16-10-23-13-24-11-16/h2,4-5,8-13,20H,3,6-7H2,1H3
290n/an/an/an/an/an/an/an/a
Lundbeck Research USA, Inc.
Curated by ChEMBL
Assay Description
Displacement of [3H]-MPEP from human mGluR5 expressed in CHO cells after 60 mins
Bioorg Med Chem Lett 21: 4891-9 (2011)
Article DOI: 10.1016/j.bmcl.2011.06.014
BindingDB Entry DOI: 10.7270/Q2CN748G
Metabotropic glutamate receptor 5
(Homo sapiens (Human))
BDBM50349567
(CHEMBL1808877)
Show SMILES Cc1cc(ncc1C1CCCN1C(=O)c1cncnc1)-c1cccc(Cl)c1
Show InChI InChI=1S/C21H19ClN4O/c1-14-8-19(15-4-2-5-17(22)9-15)25-12-18(14)20-6-3-7-26(20)21(27)16-10-23-13-24-11-16/h2,4-5,8-13,20H,3,6-7H2,1H3
n/an/a 110n/an/an/an/an/an/a
Lundbeck Research USA, Inc.
Curated by ChEMBL
Assay Description
Negative allosteric modulation of human mGlu5 receptor expressed in HEK293 cells assessed as inhibition of glutamate-induced calcium mobilization aft...
Bioorg Med Chem Lett 21: 4891-9 (2011)
Article DOI: 10.1016/j.bmcl.2011.06.014
BindingDB Entry DOI: 10.7270/Q2CN748G