BDBM50349638 CHEMBL1808996
SMILES: CN(C)C(=O)[C@H]1CN([C@@H]2Cc3c[nH]c4cccc(C2=C1)c34)C(=O)Nc1ccccc1
InChI Key: InChIKey=VFVKUTVWLQUMFR-IIBYNOLFSA-N
Data: 3 IC50
Activity Spreadsheet -- Enzyme Inhibition Constant Data from BindingDB
Found 3 hits for monomerid = 50349638
Trg + Lig
Ki
nM
ΔG°
kcal/mole
IC50
nM
Kd
nM
EC50/IC50
nM
koff
s-1
kon
M-1s-1
pHTemp
°C
chemokine (C-X-C motif) receptor 3
(Homo sapiens (Human))
BDBM50349638
(CHEMBL1808996)
Show SMILES CN(C)C(=O)[C@H]1CN([C@@H]2Cc3c[nH]c4cccc(C2=C1)c34)C(=O)Nc1ccccc1 |r,c:19|
Show InChI InChI=1S/C24H24N4O2/c1-27(2)23(29)16-11-19-18-9-6-10-20-22(18)15(13-25-20)12-21(19)28(14-16)24(30)26-17-7-4-3-5-8-17/h3-11,13,16,21,25H,12,14H2,1-2H3,(H,26,30)/t16-,21-/m1/s1
n/an/a 28n/an/an/an/an/an/a
Novartis Institutes for BioMedical Research
Curated by ChEMBL
Assay Description
Displacement of radiolabeled CXCL11 from human CXCR3 expressed in CHO cells by scintillation proximity assay
Bioorg Med Chem Lett 21: 4745-9 (2011)
Article DOI: 10.1016/j.bmcl.2011.06.070
BindingDB Entry DOI: 10.7270/Q2VM4CN5
C-X-C chemokine receptor type 3
(Mus musculus)
BDBM50349638
(CHEMBL1808996)
Show SMILES CN(C)C(=O)[C@H]1CN([C@@H]2Cc3c[nH]c4cccc(C2=C1)c34)C(=O)Nc1ccccc1 |r,c:19|
Show InChI InChI=1S/C24H24N4O2/c1-27(2)23(29)16-11-19-18-9-6-10-20-22(18)15(13-25-20)12-21(19)28(14-16)24(30)26-17-7-4-3-5-8-17/h3-11,13,16,21,25H,12,14H2,1-2H3,(H,26,30)/t16-,21-/m1/s1
Reactome pathway
n/an/a 10n/an/an/an/an/an/a
Novartis Institutes for BioMedical Research
Curated by ChEMBL
Assay Description
Antagonist activity at mouse CXCR3 expressed in mouse L1.2 cells assessed as inhibition of ITAC-induced calcium mobilization by FLIPR assay
Bioorg Med Chem Lett 21: 4745-9 (2011)
Article DOI: 10.1016/j.bmcl.2011.06.070
BindingDB Entry DOI: 10.7270/Q2VM4CN5
chemokine (C-X-C motif) receptor 3
(Homo sapiens (Human))
BDBM50349638
(CHEMBL1808996)
Show SMILES CN(C)C(=O)[C@H]1CN([C@@H]2Cc3c[nH]c4cccc(C2=C1)c34)C(=O)Nc1ccccc1 |r,c:19|
Show InChI InChI=1S/C24H24N4O2/c1-27(2)23(29)16-11-19-18-9-6-10-20-22(18)15(13-25-20)12-21(19)28(14-16)24(30)26-17-7-4-3-5-8-17/h3-11,13,16,21,25H,12,14H2,1-2H3,(H,26,30)/t16-,21-/m1/s1
n/an/a 10n/an/an/an/an/an/a
Novartis Institutes for BioMedical Research
Curated by ChEMBL
Assay Description
Antagonist activity at human CXCR3 expressed in mouse L1.2 cells assessed as inhibition of ITAC-induced calcium mobilization by FLIPR assay
Bioorg Med Chem Lett 21: 4745-9 (2011)
Article DOI: 10.1016/j.bmcl.2011.06.070
BindingDB Entry DOI: 10.7270/Q2VM4CN5