BDBM50349663 CHEMBL1809028
SMILES: O=C(NC1CCCCC1)N1C[C@@H](C=C2[C@H]1Cc1c[nH]c3cccc2c13)C(=O)N1CCCC1
InChI Key: InChIKey=LPYNOOBUNPCVBY-WZONZLPQSA-N
Data: 3 IC50
Activity Spreadsheet -- Enzyme Inhibition Constant Data from BindingDB
Found 3 hits for monomerid = 50349663
Trg + Lig
Ki
nM
ΔG°
kcal/mole
IC50
nM
Kd
nM
EC50/IC50
nM
koff
s-1
kon
M-1s-1
pHTemp
°C
chemokine (C-X-C motif) receptor 3
(Homo sapiens (Human))
BDBM50349663
(CHEMBL1809028)
Show SMILES O=C(NC1CCCCC1)N1C[C@@H](C=C2[C@H]1Cc1c[nH]c3cccc2c13)C(=O)N1CCCC1 |r,c:13|
Show InChI InChI=1S/C26H32N4O2/c31-25(29-11-4-5-12-29)18-13-21-20-9-6-10-22-24(20)17(15-27-22)14-23(21)30(16-18)26(32)28-19-7-2-1-3-8-19/h6,9-10,13,15,18-19,23,27H,1-5,7-8,11-12,14,16H2,(H,28,32)/t18-,23-/m1/s1
n/an/a 24n/an/an/an/an/an/a
Novartis Institutes for BioMedical Research
Curated by ChEMBL
Assay Description
Displacement of radiolabeled CXCL11 from human CXCR3 expressed in CHO cells by scintillation proximity assay
Bioorg Med Chem Lett 21: 4745-9 (2011)
Article DOI: 10.1016/j.bmcl.2011.06.070
BindingDB Entry DOI: 10.7270/Q2VM4CN5
C-X-C chemokine receptor type 3
(Mus musculus)
BDBM50349663
(CHEMBL1809028)
Show SMILES O=C(NC1CCCCC1)N1C[C@@H](C=C2[C@H]1Cc1c[nH]c3cccc2c13)C(=O)N1CCCC1 |r,c:13|
Show InChI InChI=1S/C26H32N4O2/c31-25(29-11-4-5-12-29)18-13-21-20-9-6-10-22-24(20)17(15-27-22)14-23(21)30(16-18)26(32)28-19-7-2-1-3-8-19/h6,9-10,13,15,18-19,23,27H,1-5,7-8,11-12,14,16H2,(H,28,32)/t18-,23-/m1/s1
Reactome pathway
n/an/a 31n/an/an/an/an/an/a
Novartis Institutes for BioMedical Research
Curated by ChEMBL
Assay Description
Antagonist activity at mouse CXCR3 expressed in mouse L1.2 cells assessed as inhibition of ITAC-induced calcium mobilization by FLIPR assay
Bioorg Med Chem Lett 21: 4745-9 (2011)
Article DOI: 10.1016/j.bmcl.2011.06.070
BindingDB Entry DOI: 10.7270/Q2VM4CN5
chemokine (C-X-C motif) receptor 3
(Homo sapiens (Human))
BDBM50349663
(CHEMBL1809028)
Show SMILES O=C(NC1CCCCC1)N1C[C@@H](C=C2[C@H]1Cc1c[nH]c3cccc2c13)C(=O)N1CCCC1 |r,c:13|
Show InChI InChI=1S/C26H32N4O2/c31-25(29-11-4-5-12-29)18-13-21-20-9-6-10-22-24(20)17(15-27-22)14-23(21)30(16-18)26(32)28-19-7-2-1-3-8-19/h6,9-10,13,15,18-19,23,27H,1-5,7-8,11-12,14,16H2,(H,28,32)/t18-,23-/m1/s1
n/an/a 11n/an/an/an/an/an/a
Novartis Institutes for BioMedical Research
Curated by ChEMBL
Assay Description
Antagonist activity at human CXCR3 expressed in mouse L1.2 cells assessed as inhibition of ITAC-induced calcium mobilization by FLIPR assay
Bioorg Med Chem Lett 21: 4745-9 (2011)
Article DOI: 10.1016/j.bmcl.2011.06.070
BindingDB Entry DOI: 10.7270/Q2VM4CN5