BDBM50350012 CHEMBL1813024
SMILES: CC1CCN(CC1)c1ncnc(Nc2cccc(NC(C)=O)c2)n1
InChI Key: InChIKey=YHRJRPQRDUBXJB-UHFFFAOYSA-N
Data: 1 IC50
Activity Spreadsheet -- Enzyme Inhibition Constant Data from BindingDB
Found 1 hit for monomerid = 50350012
Trg + Lig
Ki
nM
ΔG°
kcal/mole
IC50
nM
Kd
nM
EC50/IC50
nM
koff
s-1
kon
M-1s-1
pHTemp
°C
Sodium channel protein type 9 subunit alpha
(Homo sapiens (Human))
BDBM50350012
(CHEMBL1813024)
Show SMILES CC1CCN(CC1)c1ncnc(Nc2cccc(NC(C)=O)c2)n1
Show InChI InChI=1S/C17H22N6O/c1-12-6-8-23(9-7-12)17-19-11-18-16(22-17)21-15-5-3-4-14(10-15)20-13(2)24/h3-5,10-12H,6-9H2,1-2H3,(H,20,24)(H,18,19,21,22)
n/an/a>1.00E+4n/an/an/an/an/an/a
Amgen Inc.
Curated by ChEMBL
Assay Description
Inhibition of human sodium channel Nav1.7 expressed in human HEK293 cells by patch-clamp electrophysiological assay
J Med Chem 54: 4427-45 (2011)
Article DOI: 10.1021/jm200018k
BindingDB Entry DOI: 10.7270/Q2N016W1