BDBM50350076 CHEMBL1813641
SMILES: Fc1ccc(cc1)-n1cccc(C(=O)Nc2ccc(Oc3ncnc4sc(cc34)-c3ccccc3)c(F)c2)c1=O
InChI Key: InChIKey=XOIQYXHTGLCEPU-UHFFFAOYSA-N
Data: 1 IC50
Activity Spreadsheet -- Enzyme Inhibition Constant Data from BindingDB
Found 1 hit for monomerid = 50350076
Trg + Lig
Ki
nM
ΔG°
kcal/mole
IC50
nM
Kd
nM
EC50/IC50
nM
koff
s-1
kon
M-1s-1
pHTemp
°C
Hepatocyte growth factor receptor
(Homo sapiens (Human))
BDBM50350076
(CHEMBL1813641)
Show SMILES Fc1ccc(cc1)-n1cccc(C(=O)Nc2ccc(Oc3ncnc4sc(cc34)-c3ccccc3)c(F)c2)c1=O
Show InChI InChI=1S/C30H18F2N4O3S/c31-19-8-11-21(12-9-19)36-14-4-7-22(30(36)38)27(37)35-20-10-13-25(24(32)15-20)39-28-23-16-26(18-5-2-1-3-6-18)40-29(23)34-17-33-28/h1-17H,(H,35,37)
n/an/a>1.00E+4n/an/an/an/an/an/a
Chinese Academy of Sciences
Curated by ChEMBL
Assay Description
Inhibition of c-Met after 60 mins by ELISA
Bioorg Med Chem 19: 3906-18 (2011)
Article DOI: 10.1016/j.bmc.2011.05.038
BindingDB Entry DOI: 10.7270/Q2CF9QGW