null
SMILES: Oc1ccc(NC(=O)c2cc(=O)c3ccccc3o2)cc1O
InChI Key: InChIKey=VKYUNPGRRJCUNW-UHFFFAOYSA-N
Activity Spreadsheet -- Enzyme Inhibition Constant Data from BindingDB
Found 4 hits for monomerid = 50350115
Trg + Lig
Ki
nM
ΔG°
kcal/mole
IC50
nM
Kd
nM
EC50/IC50
nM
koff
s-1
kon
M-1s-1
pHTemp
°C
Amine oxidase [flavin-containing] A
(Homo sapiens (Human))
BDBM50350115
(CHEMBL1814057)
Show SMILES Oc1ccc(NC(=O)c2cc(=O)c3ccccc3o2)cc1O
Show InChI InChI=1S/C16H11NO5/c18-11-6-5-9(7-13(11)20)17-16(21)15-8-12(19)10-3-1-2-4-14(10)22-15/h1-8,18,20H,(H,17,21)
n/an/a 190n/an/an/an/an/an/a
Universidade do Porto
Curated by ChEMBL
Assay Description
Inhibition of human MAO-A assessed as inhibition of p-tyramine oxidation to p-hydroxyphenyl-acetaldehyde after 15 mins by fluorimetric method
J Med Chem 54: 5165-73 (2011)
Article DOI: 10.1021/jm2004267
BindingDB Entry DOI: 10.7270/Q20865PP
Amine oxidase [flavin-containing] A
(Homo sapiens (Human))
BDBM50350115
(CHEMBL1814057)
Show SMILES Oc1ccc(NC(=O)c2cc(=O)c3ccccc3o2)cc1O
Show InChI InChI=1S/C16H11NO5/c18-11-6-5-9(7-13(11)20)17-16(21)15-8-12(19)10-3-1-2-4-14(10)22-15/h1-8,18,20H,(H,17,21)
n/an/a 191n/an/an/an/an/an/a
Universidade do Porto
Curated by ChEMBL
Assay Description
Inhibition of human recombinant MAOA
Eur J Med Chem 59: 75-90 (2013)
Article DOI: 10.1016/j.ejmech.2012.10.035
BindingDB Entry DOI: 10.7270/Q2FJ2KPX
Amine oxidase [flavin-containing] B
(Homo sapiens (Human))
BDBM50350115
(CHEMBL1814057)
Show SMILES Oc1ccc(NC(=O)c2cc(=O)c3ccccc3o2)cc1O
Show InChI InChI=1S/C16H11NO5/c18-11-6-5-9(7-13(11)20)17-16(21)15-8-12(19)10-3-1-2-4-14(10)22-15/h1-8,18,20H,(H,17,21)
n/an/a 2.63E+3n/an/an/an/an/an/a
Universidade do Porto
Curated by ChEMBL
Assay Description
Inhibition of human recombinant MAOB
Eur J Med Chem 59: 75-90 (2013)
Article DOI: 10.1016/j.ejmech.2012.10.035
BindingDB Entry DOI: 10.7270/Q2FJ2KPX
Amine oxidase [flavin-containing] B
(Homo sapiens (Human))
BDBM50350115
(CHEMBL1814057)
Show SMILES Oc1ccc(NC(=O)c2cc(=O)c3ccccc3o2)cc1O
Show InChI InChI=1S/C16H11NO5/c18-11-6-5-9(7-13(11)20)17-16(21)15-8-12(19)10-3-1-2-4-14(10)22-15/h1-8,18,20H,(H,17,21)
n/an/a 2.66E+3n/an/an/an/an/an/a
Universidade do Porto
Curated by ChEMBL
Assay Description
Inhibition of human MAO-B assessed as inhibition of p-tyramine oxidation to p-hydroxyphenyl-acetaldehyde after 15 mins by fluorimetric method
J Med Chem 54: 5165-73 (2011)
Article DOI: 10.1021/jm2004267
BindingDB Entry DOI: 10.7270/Q20865PP