BDBM50350120 CHEMBL1814073
SMILES: CCCNC(=O)c1coc2ccccc2c1=O
InChI Key: InChIKey=BGGILXYAQOCCTB-UHFFFAOYSA-N
Data: 1 IC50
Activity Spreadsheet -- Enzyme Inhibition Constant Data from BindingDB
Found 1 hit for monomerid = 50350120
Trg + Lig
Ki
nM
ΔG°
kcal/mole
IC50
nM
Kd
nM
EC50/IC50
nM
koff
s-1
kon
M-1s-1
pHTemp
°C
Amine oxidase [flavin-containing] B
(Homo sapiens (Human))
BDBM50350120
(CHEMBL1814073)
Show SMILES CCCNC(=O)c1coc2ccccc2c1=O
Show InChI InChI=1S/C13H13NO3/c1-2-7-14-13(16)10-8-17-11-6-4-3-5-9(11)12(10)15/h3-6,8H,2,7H2,1H3,(H,14,16)
n/an/a 3.77E+4n/an/an/an/an/an/a
Universidade do Porto
Curated by ChEMBL
Assay Description
Inhibition of human MAO-B assessed as inhibition of p-tyramine oxidation to p-hydroxyphenyl-acetaldehyde after 15 mins by fluorimetric method
J Med Chem 54: 5165-73 (2011)
Article DOI: 10.1021/jm2004267
BindingDB Entry DOI: 10.7270/Q20865PP