BDBM50350197 CHEMBL1814765
SMILES: Nc1ncnc2n(cc(-c3cccc4ccccc34)c12)[C@@H]1O[C@H](CO)[C@@H](O)[C@H]1O
InChI Key: InChIKey=LQJPVHNGRTWBCV-QTQZEZTPSA-N
Data: 2 IC50
Activity Spreadsheet -- Enzyme Inhibition Constant Data from BindingDB
Found 2 hits for monomerid = 50350197
Trg + Lig
Ki
nM
ΔG°
kcal/mole
IC50
nM
Kd
nM
EC50/IC50
nM
koff
s-1
kon
M-1s-1
pHTemp
°C
Adenosine kinase
(Homo sapiens (Human))
BDBM50350197
(CHEMBL1814765)
Show SMILES Nc1ncnc2n(cc(-c3cccc4ccccc34)c12)[C@@H]1O[C@H](CO)[C@@H](O)[C@H]1O |r|
Show InChI InChI=1S/C21H20N4O4/c22-19-16-14(13-7-3-5-11-4-1-2-6-12(11)13)8-25(20(16)24-10-23-19)21-18(28)17(27)15(9-26)29-21/h1-8,10,15,17-18,21,26-28H,9H2,(H2,22,23,24)/t15-,17-,18-,21-/m1/s1
Reactome pathway
n/an/a>1.00E+4n/an/an/an/an/an/a
Academy of Sciences of the Czech Republic
Curated by ChEMBL
Assay Description
Inhibition of human ADK using [3H]-adenosine by scintillation counting
J Med Chem 54: 5498-507 (2011)
Article DOI: 10.1021/jm2005173
BindingDB Entry DOI: 10.7270/Q2BK1CQX
Adenosine kinase
(Homo sapiens (Human))
BDBM50350197
(CHEMBL1814765)
Show SMILES Nc1ncnc2n(cc(-c3cccc4ccccc34)c12)[C@@H]1O[C@H](CO)[C@@H](O)[C@H]1O |r|
Show InChI InChI=1S/C21H20N4O4/c22-19-16-14(13-7-3-5-11-4-1-2-6-12(11)13)8-25(20(16)24-10-23-19)21-18(28)17(27)15(9-26)29-21/h1-8,10,15,17-18,21,26-28H,9H2,(H2,22,23,24)/t15-,17-,18-,21-/m1/s1
Reactome pathway
n/an/a>1.00E+4n/an/an/an/an/an/a
Academy of Sciences of the Czech Republic
Curated by ChEMBL
Assay Description
Inhibition of human ADK expressed in Escherichia coli BL21(DE3) cells using [3H]adenosine by liquid scintillation counting method
J Med Chem 57: 8268-79 (2014)
Article DOI: 10.1021/jm500497v
BindingDB Entry DOI: 10.7270/Q29888MK