BDBM50350647 CHEMBL1813534
SMILES: CCCCCCCCCCn1cc[n+](c1)C(c1ccccc1)c1ccccc1
InChI Key: InChIKey=POXWRQLRLXPOKT-UHFFFAOYSA-N
Data: 1 IC50
Activity Spreadsheet -- Enzyme Inhibition Constant Data from BindingDB
Found 1 hit for monomerid = 50350647
Trg + Lig
Ki
nM
ΔG°
kcal/mole
IC50
nM
Kd
nM
EC50/IC50
nM
koff
s-1
kon
M-1s-1
pHTemp
°C
Transcriptional activator protein luxR
(Vibrio fischeri)
BDBM50350647
(CHEMBL1813534)
Show SMILES CCCCCCCCCCn1cc[n+](c1)C(c1ccccc1)c1ccccc1
Show InChI InChI=1S/C26H35N2/c1-2-3-4-5-6-7-8-15-20-27-21-22-28(23-27)26(24-16-11-9-12-17-24)25-18-13-10-14-19-25/h9-14,16-19,21-23,26H,2-8,15,20H2,1H3/q+1
n/an/a 1.80E+4n/an/an/an/an/an/a
INSA Lyon
Curated by ChEMBL
Assay Description
Antagonist activity at Vibrio fischeri LuxR assessed as inhibition of 3-oxo-C6-HSL-induced quorum sensing activation mediated bioluminescence
Bioorg Med Chem 19: 4868-75 (2011)
Article DOI: 10.1016/j.bmc.2011.06.075
BindingDB Entry DOI: 10.7270/Q2CC112H