BDBM50350653 CHEMBL1813540
SMILES: CCCCCCCCCCn1cc[n+](c1)C(c1ccc(Cl)cc1)c1ccc(Cl)cc1
InChI Key: InChIKey=UNLVKGAPKHAHHV-UHFFFAOYSA-N
Data: 1 IC50
Activity Spreadsheet -- Enzyme Inhibition Constant Data from BindingDB
Found 1 hit for monomerid = 50350653
Trg + Lig
Ki
nM
ΔG°
kcal/mole
IC50
nM
Kd
nM
EC50/IC50
nM
koff
s-1
kon
M-1s-1
pHTemp
°C
Transcriptional activator protein luxR
(Vibrio fischeri)
BDBM50350653
(CHEMBL1813540)
Show SMILES CCCCCCCCCCn1cc[n+](c1)C(c1ccc(Cl)cc1)c1ccc(Cl)cc1
Show InChI InChI=1S/C26H33Cl2N2/c1-2-3-4-5-6-7-8-9-18-29-19-20-30(21-29)26(22-10-14-24(27)15-11-22)23-12-16-25(28)17-13-23/h10-17,19-21,26H,2-9,18H2,1H3/q+1
n/an/a 5.80E+3n/an/an/an/an/an/a
INSA Lyon
Curated by ChEMBL
Assay Description
Antagonist activity at Vibrio fischeri LuxR assessed as inhibition of 3-oxo-C6-HSL-induced quorum sensing activation mediated bioluminescence
Bioorg Med Chem 19: 4868-75 (2011)
Article DOI: 10.1016/j.bmc.2011.06.075
BindingDB Entry DOI: 10.7270/Q2CC112H