BDBM50350660 CHEMBL1813552
SMILES: CCCCCCCCCCCCn1cc[n+](c1)C1c2ccccc2-c2ccccc12
InChI Key: InChIKey=AANDSTDCJGVJLU-UHFFFAOYSA-N
Data: 1 IC50
Activity Spreadsheet -- Enzyme Inhibition Constant Data from BindingDB
Found 1 hit for monomerid = 50350660
Trg + Lig
Ki
nM
ΔG°
kcal/mole
IC50
nM
Kd
nM
EC50/IC50
nM
koff
s-1
kon
M-1s-1
pHTemp
°C
Transcriptional activator protein luxR
(Vibrio fischeri)
BDBM50350660
(CHEMBL1813552)
Show SMILES CCCCCCCCCCCCn1cc[n+](c1)C1c2ccccc2-c2ccccc12
Show InChI InChI=1S/C28H37N2/c1-2-3-4-5-6-7-8-9-10-15-20-29-21-22-30(23-29)28-26-18-13-11-16-24(26)25-17-12-14-19-27(25)28/h11-14,16-19,21-23,28H,2-10,15,20H2,1H3/q+1
n/an/a 1.40E+3n/an/an/an/an/an/a
INSA Lyon
Curated by ChEMBL
Assay Description
Antagonist activity at Vibrio fischeri LuxR assessed as inhibition of 3-oxo-C6-HSL-induced quorum sensing activation mediated bioluminescence
Bioorg Med Chem 19: 4868-75 (2011)
Article DOI: 10.1016/j.bmc.2011.06.075
BindingDB Entry DOI: 10.7270/Q2CC112H