BDBM50350668 CHEMBL1813545
SMILES: CCCCCCCCn1cc[n+](c1)C(c1ccc(Cl)cc1Cl)c1ccc(Cl)cc1Cl
InChI Key: InChIKey=MXPNDOAOECGSPL-UHFFFAOYSA-N
Data: 1 IC50
Activity Spreadsheet -- Enzyme Inhibition Constant Data from BindingDB
Found 1 hit for monomerid = 50350668
Trg + Lig
Ki
nM
ΔG°
kcal/mole
IC50
nM
Kd
nM
EC50/IC50
nM
koff
s-1
kon
M-1s-1
pHTemp
°C
Transcriptional activator protein luxR
(Vibrio fischeri)
BDBM50350668
(CHEMBL1813545)
Show SMILES CCCCCCCCn1cc[n+](c1)C(c1ccc(Cl)cc1Cl)c1ccc(Cl)cc1Cl
Show InChI InChI=1S/C24H27Cl4N2/c1-2-3-4-5-6-7-12-29-13-14-30(17-29)24(20-10-8-18(25)15-22(20)27)21-11-9-19(26)16-23(21)28/h8-11,13-17,24H,2-7,12H2,1H3/q+1
n/an/a 8.90E+3n/an/an/an/an/an/a
INSA Lyon
Curated by ChEMBL
Assay Description
Antagonist activity at Vibrio fischeri LuxR assessed as inhibition of 3-oxo-C6-HSL-induced quorum sensing activation mediated bioluminescence
Bioorg Med Chem 19: 4868-75 (2011)
Article DOI: 10.1016/j.bmc.2011.06.075
BindingDB Entry DOI: 10.7270/Q2CC112H