BDBM50350683 CHEMBL1813764
SMILES: Cc1ccccc1-c1nnc(o1)-c1ccc2OCCOc2c1
InChI Key: InChIKey=BJPSYXYPEVLQMU-UHFFFAOYSA-N
Data: 1 IC50
Activity Spreadsheet -- Enzyme Inhibition Constant Data from BindingDB
Found 1 hit for monomerid = 50350683
Trg + Lig
Ki
nM
ΔG°
kcal/mole
IC50
nM
Kd
nM
EC50/IC50
nM
koff
s-1
kon
M-1s-1
pHTemp
°C
Nitric Oxide Synthase, inducible
(Mus musculus (mouse))
BDBM50350683
(CHEMBL1813764)
Show SMILES Cc1ccccc1-c1nnc(o1)-c1ccc2OCCOc2c1
Show InChI InChI=1S/C17H14N2O3/c1-11-4-2-3-5-13(11)17-19-18-16(22-17)12-6-7-14-15(10-12)21-9-8-20-14/h2-7,10H,8-9H2,1H3
Reactome pathway
n/an/a 100n/an/an/an/an/an/a
Nanjing University
Curated by ChEMBL
Assay Description
Inhibition of iNOS in mouse RAW264.7 cells assessed as conversion of L-citrulline to L-arginine incubated for 30 mins by scintillation counting
Bioorg Med Chem 19: 4895-902 (2011)
Article DOI: 10.1016/j.bmc.2011.06.061
BindingDB Entry DOI: 10.7270/Q23T9HK2