BDBM50350684 CHEMBL1813769
SMILES: COc1cc(cc(OC)c1OC)-c1nnc(o1)-c1ccc2OCCOc2c1
InChI Key: InChIKey=VJVNWOXVWGOQNF-UHFFFAOYSA-N
Data: 1 IC50
Activity Spreadsheet -- Enzyme Inhibition Constant Data from BindingDB
Found 1 hit for monomerid = 50350684
Trg + Lig
Ki
nM
ΔG°
kcal/mole
IC50
nM
Kd
nM
EC50/IC50
nM
koff
s-1
kon
M-1s-1
pHTemp
°C
Nitric Oxide Synthase, inducible
(Mus musculus (mouse))
BDBM50350684
(CHEMBL1813769)
Show SMILES COc1cc(cc(OC)c1OC)-c1nnc(o1)-c1ccc2OCCOc2c1
Show InChI InChI=1S/C19H18N2O6/c1-22-15-9-12(10-16(23-2)17(15)24-3)19-21-20-18(27-19)11-4-5-13-14(8-11)26-7-6-25-13/h4-5,8-10H,6-7H2,1-3H3
Reactome pathway
n/an/a 120n/an/an/an/an/an/a
Nanjing University
Curated by ChEMBL
Assay Description
Inhibition of iNOS in mouse RAW264.7 cells assessed as conversion of L-citrulline to L-arginine incubated for 30 mins by scintillation counting
Bioorg Med Chem 19: 4895-902 (2011)
Article DOI: 10.1016/j.bmc.2011.06.061
BindingDB Entry DOI: 10.7270/Q23T9HK2