BDBM50350712 CHEMBL1812084
SMILES: [O-][N+](=O)c1cccc(CC(=O)N[C@H]2CCSC2=O)c1
InChI Key: InChIKey=RPWDLHYCWNMCOW-JTQLQIEISA-N
Data: 1 EC50
Activity Spreadsheet -- Enzyme Inhibition Constant Data from BindingDB
Found 1 hit for monomerid = 50350712
Trg + Lig
Ki
nM
ΔG°
kcal/mole
IC50
nM
Kd
nM
EC50/IC50
nM
koff
s-1
kon
M-1s-1
pHTemp
°C
Transcriptional activator protein luxR
(Vibrio fischeri)
BDBM50350712
(CHEMBL1812084)
Show SMILES [O-][N+](=O)c1cccc(CC(=O)N[C@H]2CCSC2=O)c1 |r|
Show InChI InChI=1S/C12H12N2O4S/c15-11(13-10-4-5-19-12(10)16)7-8-2-1-3-9(6-8)14(17)18/h1-3,6,10H,4-5,7H2,(H,13,15)/t10-/m0/s1
n/an/an/an/a 1.10E+4n/an/an/an/a
University of Wisconsin-Madison
Curated by ChEMBL
Assay Description
Agonist activity at Vibrio fischeri ESI 114 (delta-LuxI) LuxR after 8 hrs by beta-galactosidase reporter gene assay relative to OdDHL
Bioorg Med Chem 19: 4820-8 (2011)
Article DOI: 10.1016/j.bmc.2011.06.071
BindingDB Entry DOI: 10.7270/Q27D2W47