null
SMILES: OC[C@@H]1CNC[C@H](O)[C@@H]1O
InChI Key: InChIKey=QPYJXFZUIJOGNX-HCWXCVPCSA-N
Activity Spreadsheet -- Enzyme Inhibition Constant Data from BindingDB
Found 1 hit for monomerid = 50350759
Trg + Lig
Ki
nM
ΔG°
kcal/mole
IC50
nM
Kd
nM
EC50/IC50
nM
koff
s-1
kon
M-1s-1
pHTemp
°C
Lactase/phlorizin hydrolase
(Rattus norvegicus)
BDBM50350759
(CHEMBL1818434)
Show SMILES OC[C@@H]1CNC[C@H](O)[C@@H]1O |r|
Show InChI InChI=1S/C6H13NO3/c8-3-4-1-7-2-5(9)6(4)10/h4-10H,1-3H2/t4-,5-,6+/m0/s1
n/an/a 9.00E+4n/an/an/an/an/an/a
University of Toyama
Curated by ChEMBL
Assay Description
Inhibition of rat intestinal lactase assessed as production of p-nitrophenol by spectrophotometry
Bioorg Med Chem 19: 3558-68 (2011)
Article DOI: 10.1016/j.bmc.2011.04.011
BindingDB Entry DOI: 10.7270/Q2BC3ZWW