BDBM50350825 CHEMBL1819265
SMILES: ONC(=O)C=Cc1ccc(CNCCc2c[nH]c3ccncc23)cc1
InChI Key: InChIKey=GYVBOCYZRIRHIA-UHFFFAOYSA-N
Data: 1 IC50
Activity Spreadsheet -- Enzyme Inhibition Constant Data from BindingDB
Found 1 hit for monomerid = 50350825
Trg + Lig
Ki
nM
ΔG°
kcal/mole
IC50
nM
Kd
nM
EC50/IC50
nM
koff
s-1
kon
M-1s-1
pHTemp
°C
Histone deacetylase 1
(Homo sapiens (Human))
BDBM50350825
(CHEMBL1819265)
Show SMILES ONC(=O)C=Cc1ccc(CNCCc2c[nH]c3ccncc23)cc1 |w:5.5|
Show InChI InChI=1S/C19H20N4O2/c24-19(23-25)6-5-14-1-3-15(4-2-14)11-20-9-7-16-12-22-18-8-10-21-13-17(16)18/h1-6,8,10,12-13,20,22,25H,7,9,11H2,(H,23,24)
NCI pathway
Reactome pathway
n/an/a 21n/an/an/an/an/an/a
Novartis Institutes for Biomedical Research
Curated by ChEMBL
Assay Description
Inhibition of HDAC1
J Med Chem 54: 4752-72 (2011)
Article DOI: 10.1021/jm200388e
BindingDB Entry DOI: 10.7270/Q23N24DW