BDBM50350828 CHEMBL1819268
SMILES: ONC(=O)\C=C\c1ccc(CNCCc2cnc3ccccn23)cc1
InChI Key: InChIKey=UNPUPHZKXHNIRL-CMDGGOBGSA-N
Data: 1 IC50
Activity Spreadsheet -- Enzyme Inhibition Constant Data from BindingDB
Found 1 hit for monomerid = 50350828
Trg + Lig
Ki
nM
ΔG°
kcal/mole
IC50
nM
Kd
nM
EC50/IC50
nM
koff
s-1
kon
M-1s-1
pHTemp
°C
Histone deacetylase 1
(Homo sapiens (Human))
BDBM50350828
(CHEMBL1819268)
Show SMILES ONC(=O)\C=C\c1ccc(CNCCc2cnc3ccccn23)cc1
Show InChI InChI=1S/C19H20N4O2/c24-19(22-25)9-8-15-4-6-16(7-5-15)13-20-11-10-17-14-21-18-3-1-2-12-23(17)18/h1-9,12,14,20,25H,10-11,13H2,(H,22,24)/b9-8+
NCI pathway
Reactome pathway
n/an/a 10n/an/an/an/an/an/a
Novartis Institutes for Biomedical Research
Curated by ChEMBL
Assay Description
Inhibition of HDAC1
J Med Chem 54: 4752-72 (2011)
Article DOI: 10.1021/jm200388e
BindingDB Entry DOI: 10.7270/Q23N24DW