BDBM50351495 CHEMBL1819620
SMILES: CN1C[C@@H](COc2ccc(C(=O)Nc3cc(C)cc(CC(O)=O)c3)c(Cl)c2)Oc2ccccc12
InChI Key: InChIKey=DJKMTKPWOQBKSW-FQEVSTJZSA-N
Data: 1 KI  1 IC50
Activity Spreadsheet -- Enzyme Inhibition Constant Data from BindingDB
Found 2 hits for monomerid = 50351495
Trg + Lig
Ki
nM
ΔG°
kcal/mole
IC50
nM
Kd
nM
EC50/IC50
nM
koff
s-1
kon
M-1s-1
pHTemp
°C
Prostanoid DP receptor
(Mus musculus)
BDBM50351495
(CHEMBL1819620)
Show SMILES CN1C[C@@H](COc2ccc(C(=O)Nc3cc(C)cc(CC(O)=O)c3)c(Cl)c2)Oc2ccccc12 |r|
Show InChI InChI=1S/C26H25ClN2O5/c1-16-9-17(12-25(30)31)11-18(10-16)28-26(32)21-8-7-19(13-22(21)27)33-15-20-14-29(2)23-5-3-4-6-24(23)34-20/h3-11,13,20H,12,14-15H2,1-2H3,(H,28,32)(H,30,31)/t20-/m0/s1
Reactome pathway
12n/an/an/an/an/an/an/an/a
Minase Research Institute
Curated by ChEMBL
Assay Description
Displacement of [3H]PGD2 from mouse prostanoid DP receptor expressed in CHO cells after 60 mins by liquid scintillation counting
Bioorg Med Chem 19: 5361-71 (2011)
Article DOI: 10.1016/j.bmc.2011.08.007
BindingDB Entry DOI: 10.7270/Q2X067DJ
Prostanoid DP receptor
(Mus musculus)
BDBM50351495
(CHEMBL1819620)
Show SMILES CN1C[C@@H](COc2ccc(C(=O)Nc3cc(C)cc(CC(O)=O)c3)c(Cl)c2)Oc2ccccc12 |r|
Show InChI InChI=1S/C26H25ClN2O5/c1-16-9-17(12-25(30)31)11-18(10-16)28-26(32)21-8-7-19(13-22(21)27)33-15-20-14-29(2)23-5-3-4-6-24(23)34-20/h3-11,13,20H,12,14-15H2,1-2H3,(H,28,32)(H,30,31)/t20-/m0/s1
Reactome pathway
n/an/a 5.40n/an/an/an/an/an/a
Minase Research Institute
Curated by ChEMBL
Assay Description
Antagonist activity at mouse prostanoid DP receptor expressed in CHO cells assessed as inhibition of PGD2-induced intracellular cAMP production
Bioorg Med Chem 19: 5361-71 (2011)
Article DOI: 10.1016/j.bmc.2011.08.007
BindingDB Entry DOI: 10.7270/Q2X067DJ