null
SMILES: CNC(=O)c1ccc(cc1Cl)-c1ccc2nnc(Cc3ccc(O)cc3)n2n1
InChI Key: InChIKey=AELVRPDBJHETKG-UHFFFAOYSA-N
Activity Spreadsheet -- Enzyme Inhibition Constant Data from BindingDB
Found 1 hit for monomerid = 50351579
Trg + Lig
Ki
nM
ΔG°
kcal/mole
IC50
nM
Kd
nM
EC50/IC50
nM
koff
s-1
kon
M-1s-1
pHTemp
°C
Hepatocyte growth factor receptor
(Homo sapiens (Human))
BDBM50351579
(CHEMBL494985)
Show SMILES CNC(=O)c1ccc(cc1Cl)-c1ccc2nnc(Cc3ccc(O)cc3)n2n1
Show InChI InChI=1S/C20H16ClN5O2/c1-22-20(28)15-7-4-13(11-16(15)21)17-8-9-18-23-24-19(26(18)25-17)10-12-2-5-14(27)6-3-12/h2-9,11,27H,10H2,1H3,(H,22,28)
n/an/a 1n/an/an/an/an/an/a
Sichuan University
Curated by ChEMBL
Assay Description
Inhibition of human c-MET
Eur J Med Chem 46: 3675-80 (2011)
Article DOI: 10.1016/j.ejmech.2011.05.031
BindingDB Entry DOI: 10.7270/Q2891676