null
SMILES: CN(C)CCCNC(=O)c1cc2NC(=O)C(=NNC(=O)Cc3ccc4occc4c3)c2c(Br)c1
InChI Key: InChIKey=ZXTMIELGNHBESS-UHFFFAOYSA-N
Activity Spreadsheet -- Enzyme Inhibition Constant Data from BindingDB
Found 1 hit for monomerid = 50351667
Trg + Lig
Ki
nM
ΔG°
kcal/mole
IC50
nM
Kd
nM
EC50/IC50
nM
koff
s-1
kon
M-1s-1
pHTemp
°C
Hepatocyte growth factor receptor
(Homo sapiens (Human))
BDBM50351667
(CHEMBL1822371)
Show SMILES CN(C)CCCNC(=O)c1cc2NC(=O)C(=NNC(=O)Cc3ccc4occc4c3)c2c(Br)c1 |w:16.16|
Show InChI InChI=1S/C24H24BrN5O4/c1-30(2)8-3-7-26-23(32)16-12-17(25)21-18(13-16)27-24(33)22(21)29-28-20(31)11-14-4-5-19-15(10-14)6-9-34-19/h4-6,9-10,12-13H,3,7-8,11H2,1-2H3,(H,26,32)(H,28,31)(H,27,29,33)
n/an/a 1.60n/an/an/an/an/an/a
Sichuan University
Curated by ChEMBL
Assay Description
Inhibition of human c-MET
Eur J Med Chem 46: 3675-80 (2011)
Article DOI: 10.1016/j.ejmech.2011.05.031
BindingDB Entry DOI: 10.7270/Q2891676