null
SMILES: Oc1ccc(Cc2nnc3ccc(nn23)-c2cccs2)cc1
InChI Key: InChIKey=SNZHSOXSUDAZPM-UHFFFAOYSA-N
Activity Spreadsheet -- Enzyme Inhibition Constant Data from BindingDB
Found 1 hit for monomerid = 50351749
Trg + Lig
Ki
nM
ΔG°
kcal/mole
IC50
nM
Kd
nM
EC50/IC50
nM
koff
s-1
kon
M-1s-1
pHTemp
°C
Hepatocyte growth factor receptor
(Homo sapiens (Human))
BDBM50351749
(CHEMBL523386)
Show SMILES Oc1ccc(Cc2nnc3ccc(nn23)-c2cccs2)cc1
Show InChI InChI=1S/C16H12N4OS/c21-12-5-3-11(4-6-12)10-16-18-17-15-8-7-13(19-20(15)16)14-2-1-9-22-14/h1-9,21H,10H2
n/an/a 2n/an/an/an/an/an/a
Sichuan University
Curated by ChEMBL
Assay Description
Inhibition of human c-MET
Eur J Med Chem 46: 3675-80 (2011)
Article DOI: 10.1016/j.ejmech.2011.05.031
BindingDB Entry DOI: 10.7270/Q2891676