BDBM50351777 CHEMBL1823755
SMILES: OC(=O)C(Cc1ccc2cc(OCc3ccccc3F)ccc2c1)NC(=O)Cc1ccc(Cl)cc1
InChI Key: InChIKey=OMYGRKDVWQTYOK-UHFFFAOYSA-N
Data: 4 IC50
Activity Spreadsheet -- Enzyme Inhibition Constant Data from BindingDB
Found 4 hits for monomerid = 50351777
Trg + Lig
Ki
nM
ΔG°
kcal/mole
IC50
nM
Kd
nM
EC50/IC50
nM
koff
s-1
kon
M-1s-1
pHTemp
°C
Protein-tyrosine phosphatase 1C
(Homo sapiens (Human))
BDBM50351777
(CHEMBL1823755)
Show SMILES OC(=O)C(Cc1ccc2cc(OCc3ccccc3F)ccc2c1)NC(=O)Cc1ccc(Cl)cc1
Show InChI InChI=1S/C28H23ClFNO4/c29-23-10-6-18(7-11-23)15-27(32)31-26(28(33)34)14-19-5-8-21-16-24(12-9-20(21)13-19)35-17-22-3-1-2-4-25(22)30/h1-13,16,26H,14-15,17H2,(H,31,32)(H,33,34)
Reactome pathway
n/an/a 1.56E+4n/an/an/an/a8.0n/a
Yanbian University
Curated by ChEMBL
Assay Description
Inhibition of human recombinant SHP1 in Tris buffer at pH 8 using OMPF as substrate
Eur J Med Chem 46: 3630-8 (2011)
Article DOI: 10.1016/j.ejmech.2011.05.027
BindingDB Entry DOI: 10.7270/Q2W09685
Dual specificity phosphatase Cdc25B
(Homo sapiens (Human))
BDBM50351777
(CHEMBL1823755)
Show SMILES OC(=O)C(Cc1ccc2cc(OCc3ccccc3F)ccc2c1)NC(=O)Cc1ccc(Cl)cc1
Show InChI InChI=1S/C28H23ClFNO4/c29-23-10-6-18(7-11-23)15-27(32)31-26(28(33)34)14-19-5-8-21-16-24(12-9-20(21)13-19)35-17-22-3-1-2-4-25(22)30/h1-13,16,26H,14-15,17H2,(H,31,32)(H,33,34)
Reactome pathway
n/an/a 8.44E+3n/an/an/an/an/an/a
Yanbian University
Curated by ChEMBL
Assay Description
Inhibition of human recombinant CDC25B
Eur J Med Chem 46: 3630-8 (2011)
Article DOI: 10.1016/j.ejmech.2011.05.027
BindingDB Entry DOI: 10.7270/Q2W09685
Tyrosine-protein phosphatase non-receptor type 2
(Homo sapiens (Human))
BDBM50351777
(CHEMBL1823755)
Show SMILES OC(=O)C(Cc1ccc2cc(OCc3ccccc3F)ccc2c1)NC(=O)Cc1ccc(Cl)cc1
Show InChI InChI=1S/C28H23ClFNO4/c29-23-10-6-18(7-11-23)15-27(32)31-26(28(33)34)14-19-5-8-21-16-24(12-9-20(21)13-19)35-17-22-3-1-2-4-25(22)30/h1-13,16,26H,14-15,17H2,(H,31,32)(H,33,34)
n/an/a 1.29E+4n/an/an/an/an/an/a
Yanbian University
Curated by ChEMBL
Assay Description
Inhibition of TCPTP
Eur J Med Chem 46: 3630-8 (2011)
Article DOI: 10.1016/j.ejmech.2011.05.027
BindingDB Entry DOI: 10.7270/Q2W09685
Protein-tyrosine phosphatase 1B
(Homo sapiens (Human))
BDBM50351777
(CHEMBL1823755)
Show SMILES OC(=O)C(Cc1ccc2cc(OCc3ccccc3F)ccc2c1)NC(=O)Cc1ccc(Cl)cc1
Show InChI InChI=1S/C28H23ClFNO4/c29-23-10-6-18(7-11-23)15-27(32)31-26(28(33)34)14-19-5-8-21-16-24(12-9-20(21)13-19)35-17-22-3-1-2-4-25(22)30/h1-13,16,26H,14-15,17H2,(H,31,32)(H,33,34)
NCI pathway
Reactome pathway
n/an/a 7.91E+3n/an/an/an/an/an/a
Yanbian University
Curated by ChEMBL
Assay Description
Inhibition of PTP1B using p-nitrophenyl phosphate as substrate
Eur J Med Chem 46: 3630-8 (2011)
Article DOI: 10.1016/j.ejmech.2011.05.027
BindingDB Entry DOI: 10.7270/Q2W09685