BDBM50352037 CHEMBL1823804
SMILES: Oc1[nH]c(=O)sc1Cc1ccc2OC(F)(F)Oc2c1
InChI Key: InChIKey=ZUVHHSQMUBNILY-UHFFFAOYSA-N
Data: 1 KI  2 IC50
Activity Spreadsheet -- Enzyme Inhibition Constant Data from BindingDB
Found 3 hits for monomerid = 50352037
Trg + Lig
Ki
nM
ΔG°
kcal/mole
IC50
nM
Kd
nM
EC50/IC50
nM
koff
s-1
kon
M-1s-1
pHTemp
°C
CDGSH iron-sulfur domain-containing protein 1
(Homo sapiens (Human))
BDBM50352037
(CHEMBL1823804)
Show SMILES Oc1[nH]c(=O)sc1Cc1ccc2OC(F)(F)Oc2c1
Show InChI InChI=1S/C11H7F2NO4S/c12-11(13)17-6-2-1-5(3-7(6)18-11)4-8-9(15)14-10(16)19-8/h1-3,15H,4H2,(H,14,16)
224n/an/an/an/an/an/an/an/a
West Virginia University
Curated by ChEMBL
Assay Description
Displacement of [3H]rosiglitazone from recombinant human C-terminal His-tagged MitoNEET cytosolic domain (32 to 108 residues) expressed in Escherichi...
Bioorg Med Chem Lett 26: 5350-5353 (2016)
Article DOI: 10.1016/j.bmcl.2016.09.009
BindingDB Entry DOI: 10.7270/Q2ZP483C
CDGSH iron-sulfur domain-containing protein 1
(Homo sapiens (Human))
BDBM50352037
(CHEMBL1823804)
Show SMILES Oc1[nH]c(=O)sc1Cc1ccc2OC(F)(F)Oc2c1
Show InChI InChI=1S/C11H7F2NO4S/c12-11(13)17-6-2-1-5(3-7(6)18-11)4-8-9(15)14-10(16)19-8/h1-3,15H,4H2,(H,14,16)
n/an/a 5.23E+3n/an/an/an/an/an/a
Northeast Ohio Medical University
Curated by ChEMBL
Assay Description
Displacement of [3H]-rosiglitazone from human recombinant C-terminal His-tagged cytosolic domain of mitoNEET (32-108) by scintillation proximity assa...
Bioorg Med Chem Lett 21: 5498-501 (2011)
Article DOI: 10.1016/j.bmcl.2011.06.111
BindingDB Entry DOI: 10.7270/Q2T43TFB
CDGSH iron-sulfur domain-containing protein 1
(Homo sapiens (Human))
BDBM50352037
(CHEMBL1823804)
Show SMILES Oc1[nH]c(=O)sc1Cc1ccc2OC(F)(F)Oc2c1
Show InChI InChI=1S/C11H7F2NO4S/c12-11(13)17-6-2-1-5(3-7(6)18-11)4-8-9(15)14-10(16)19-8/h1-3,15H,4H2,(H,14,16)
n/an/a 5.23E+3n/an/an/an/an/an/a
West Virginia University
Curated by ChEMBL
Assay Description
Displacement of [3H]rosiglitazone from recombinant human C-terminal His-tagged MitoNEET cytosolic domain (32 to 108 residues) expressed in Escherichi...
Bioorg Med Chem Lett 26: 5350-5353 (2016)
Article DOI: 10.1016/j.bmcl.2016.09.009
BindingDB Entry DOI: 10.7270/Q2ZP483C