BDBM50352314 CHEMBL1822492
SMILES: Cc1cc(Nc2nc(Sc3ccc(NC(=O)CNC4CCCC4)cc3)nn3cccc23)n[nH]1
InChI Key: InChIKey=QKYQHNYADWTLSP-UHFFFAOYSA-N
Data: 1 IC50  3 Kd
Activity Spreadsheet -- Enzyme Inhibition Constant Data from BindingDB
Found 4 hits for monomerid = 50352314
Trg + Lig
Ki
nM
ΔG°
kcal/mole
IC50
nM
Kd
nM
EC50/IC50
nM
koff
s-1
kon
M-1s-1
pHTemp
°C
Aurora kinase B
(Homo sapiens (Human))
BDBM50352314
(CHEMBL1822492)
Show SMILES Cc1cc(Nc2nc(Sc3ccc(NC(=O)CNC4CCCC4)cc3)nn3cccc23)n[nH]1
Show InChI InChI=1S/C23H26N8OS/c1-15-13-20(29-28-15)26-22-19-7-4-12-31(19)30-23(27-22)33-18-10-8-17(9-11-18)25-21(32)14-24-16-5-2-3-6-16/h4,7-13,16,24H,2-3,5-6,14H2,1H3,(H,25,32)(H2,26,27,28,29,30)
Reactome pathway
n/an/a 655n/an/an/an/an/an/a
Ambit Biosciences Corporation
Curated by ChEMBL
Assay Description
Inhibition of Aurora B kinase assessed as reduction in histone H3 phosphorylation in human HCT116 cells
Bioorg Med Chem Lett 21: 5296-300 (2011)
Article DOI: 10.1016/j.bmcl.2011.07.027
BindingDB Entry DOI: 10.7270/Q20P10D8
Aurora kinase A
(Homo sapiens (Human))
BDBM50352314
(CHEMBL1822492)
Show SMILES Cc1cc(Nc2nc(Sc3ccc(NC(=O)CNC4CCCC4)cc3)nn3cccc23)n[nH]1
Show InChI InChI=1S/C23H26N8OS/c1-15-13-20(29-28-15)26-22-19-7-4-12-31(19)30-23(27-22)33-18-10-8-17(9-11-18)25-21(32)14-24-16-5-2-3-6-16/h4,7-13,16,24H,2-3,5-6,14H2,1H3,(H,25,32)(H2,26,27,28,29,30)
NCI pathway
Reactome pathway
n/an/an/a 143n/an/an/an/an/a
Ambit Biosciences Corporation
Curated by ChEMBL
Assay Description
Binding affinity to Aurora A kinase catalytic domain by competitive binding assay
Bioorg Med Chem Lett 21: 5296-300 (2011)
Article DOI: 10.1016/j.bmcl.2011.07.027
BindingDB Entry DOI: 10.7270/Q20P10D8
Serine/threonine-protein kinase Aurora-C
(Homo sapiens (Human))
BDBM50352314
(CHEMBL1822492)
Show SMILES Cc1cc(Nc2nc(Sc3ccc(NC(=O)CNC4CCCC4)cc3)nn3cccc23)n[nH]1
Show InChI InChI=1S/C23H26N8OS/c1-15-13-20(29-28-15)26-22-19-7-4-12-31(19)30-23(27-22)33-18-10-8-17(9-11-18)25-21(32)14-24-16-5-2-3-6-16/h4,7-13,16,24H,2-3,5-6,14H2,1H3,(H,25,32)(H2,26,27,28,29,30)
NCI pathway
n/an/an/a 14n/an/an/an/an/a
Ambit Biosciences Corporation
Curated by ChEMBL
Assay Description
Binding affinity to Aurora C kinase catalytic domain by competitive binding assay
Bioorg Med Chem Lett 21: 5296-300 (2011)
Article DOI: 10.1016/j.bmcl.2011.07.027
BindingDB Entry DOI: 10.7270/Q20P10D8
Aurora kinase B
(Homo sapiens (Human))
BDBM50352314
(CHEMBL1822492)
Show SMILES Cc1cc(Nc2nc(Sc3ccc(NC(=O)CNC4CCCC4)cc3)nn3cccc23)n[nH]1
Show InChI InChI=1S/C23H26N8OS/c1-15-13-20(29-28-15)26-22-19-7-4-12-31(19)30-23(27-22)33-18-10-8-17(9-11-18)25-21(32)14-24-16-5-2-3-6-16/h4,7-13,16,24H,2-3,5-6,14H2,1H3,(H,25,32)(H2,26,27,28,29,30)
Reactome pathway
n/an/an/a 42n/an/an/an/an/a
Ambit Biosciences Corporation
Curated by ChEMBL
Assay Description
Binding affinity to Aurora B kinase catalytic domain by competitive binding assay
Bioorg Med Chem Lett 21: 5296-300 (2011)
Article DOI: 10.1016/j.bmcl.2011.07.027
BindingDB Entry DOI: 10.7270/Q20P10D8