BDBM50352355 CHEMBL560140
SMILES: CC1CCCN1CCc1ccc(cc1)-c1ccc(cc1)S(=O)(=O)N1CCS(=O)(=O)CC1
InChI Key: InChIKey=WUKAZLUXSULUEP-UHFFFAOYSA-N
Data: 2 KI  1 IC50
Activity Spreadsheet -- Enzyme Inhibition Constant Data from BindingDB
Found 3 hits for monomerid = 50352355
Trg + Lig
Ki
nM
ΔG°
kcal/mole
IC50
nM
Kd
nM
EC50/IC50
nM
koff
s-1
kon
M-1s-1
pHTemp
°C
Histamine H3 receptor
(Rattus norvegicus (rat))
BDBM50352355
(CHEMBL560140)
Show SMILES CC1CCCN1CCc1ccc(cc1)-c1ccc(cc1)S(=O)(=O)N1CCS(=O)(=O)CC1
Show InChI InChI=1S/C23H30N2O4S2/c1-19-3-2-13-24(19)14-12-20-4-6-21(7-5-20)22-8-10-23(11-9-22)31(28,29)25-15-17-30(26,27)18-16-25/h4-11,19H,2-3,12-18H2,1H3
Reactome pathway
0.933n/an/an/an/an/an/an/an/a
Arena Pharmaceuticals
Curated by ChEMBL
Assay Description
Displacement of N-[3H]methylhistamine from histamine H3 receptor in rat cortex membrane
J Med Chem 52: 5603-11 (2009)
Article DOI: 10.1021/jm900857n
BindingDB Entry DOI: 10.7270/Q2KW5G2F
Histamine H3 receptor
(Homo sapiens (Human))
BDBM50352355
(CHEMBL560140)
Show SMILES CC1CCCN1CCc1ccc(cc1)-c1ccc(cc1)S(=O)(=O)N1CCS(=O)(=O)CC1
Show InChI InChI=1S/C23H30N2O4S2/c1-19-3-2-13-24(19)14-12-20-4-6-21(7-5-20)22-8-10-23(11-9-22)31(28,29)25-15-17-30(26,27)18-16-25/h4-11,19H,2-3,12-18H2,1H3
Reactome pathway
1n/an/an/an/an/an/an/an/a
Bioprojet-Biotech
Curated by ChEMBL
Assay Description
Displacement of [125I]Iodoproxyfan from human recombinant histamine H3 receptor by Competitive binding assay
Bioorg Med Chem Lett 21: 5378-83 (2011)
Article DOI: 10.1016/j.bmcl.2011.07.006
BindingDB Entry DOI: 10.7270/Q2VX0GXK
Potassium voltage-gated channel subfamily H member 2
(Homo sapiens (Human))
BDBM50352355
(CHEMBL560140)
Show SMILES CC1CCCN1CCc1ccc(cc1)-c1ccc(cc1)S(=O)(=O)N1CCS(=O)(=O)CC1
Show InChI InChI=1S/C23H30N2O4S2/c1-19-3-2-13-24(19)14-12-20-4-6-21(7-5-20)22-8-10-23(11-9-22)31(28,29)25-15-17-30(26,27)18-16-25/h4-11,19H,2-3,12-18H2,1H3
Reactome pathway
n/an/a 9.50E+3n/an/an/an/an/an/a
Bioprojet-Biotech
Curated by ChEMBL
Assay Description
Displacement of [3H]dofetilide from human recombinant ERG by Competitive binding assay
Bioorg Med Chem Lett 21: 5378-83 (2011)
Article DOI: 10.1016/j.bmcl.2011.07.006
BindingDB Entry DOI: 10.7270/Q2VX0GXK