null
SMILES: Nc1ncc(cc1OCc1ccccc1C(F)(F)F)-c1ccc(cc1)C(=O)N1CCC[C@@H]1CN1CCCC1
InChI Key: InChIKey=VBZNTJZERXQKQT-XMMPIXPASA-N
Activity Spreadsheet -- Enzyme Inhibition Constant Data from BindingDB
Found 2 hits for monomerid = 50352527
Trg + Lig
Ki
nM
ΔG°
kcal/mole
IC50
nM
Kd
nM
EC50/IC50
nM
koff
s-1
kon
M-1s-1
pHTemp
°C
Hepatocyte growth factor receptor
(Homo sapiens (Human))
BDBM50352527
(CHEMBL1824871)
Show SMILES Nc1ncc(cc1OCc1ccccc1C(F)(F)F)-c1ccc(cc1)C(=O)N1CCC[C@@H]1CN1CCCC1 |r|
Show InChI InChI=1S/C29H31F3N4O2/c30-29(31,32)25-8-2-1-6-22(25)19-38-26-16-23(17-34-27(26)33)20-9-11-21(12-10-20)28(37)36-15-5-7-24(36)18-35-13-3-4-14-35/h1-2,6,8-12,16-17,24H,3-5,7,13-15,18-19H2,(H2,33,34)/t24-/m1/s1
n/an/a 7.11E+3n/an/an/an/an/an/a
Pfizer Inc.
Curated by ChEMBL
Assay Description
Inhibition of human recombinant c-MET kinase expressed in A549 cells assessed as inhibition of HGF-induced autophosphorylation by ELISA method
J Med Chem 54: 6342-63 (2011)
Article DOI: 10.1021/jm2007613
BindingDB Entry DOI: 10.7270/Q2Q52Q09
Hepatocyte growth factor receptor
(Homo sapiens (Human))
BDBM50352527
(CHEMBL1824871)
Show SMILES Nc1ncc(cc1OCc1ccccc1C(F)(F)F)-c1ccc(cc1)C(=O)N1CCC[C@@H]1CN1CCCC1 |r|
Show InChI InChI=1S/C29H31F3N4O2/c30-29(31,32)25-8-2-1-6-22(25)19-38-26-16-23(17-34-27(26)33)20-9-11-21(12-10-20)28(37)36-15-5-7-24(36)18-35-13-3-4-14-35/h1-2,6,8-12,16-17,24H,3-5,7,13-15,18-19H2,(H2,33,34)/t24-/m1/s1
2.59E+3n/an/an/an/an/an/an/an/a
Pfizer Inc.
Curated by ChEMBL
Assay Description
Binding affinity to human recombinant c-MET assessed as inhibition of autophosphorylation by continuous fluorometric assay
J Med Chem 54: 6342-63 (2011)
Article DOI: 10.1021/jm2007613
BindingDB Entry DOI: 10.7270/Q2Q52Q09