null
SMILES: Nc1ncc(cc1OCc1c(F)ccc(F)c1Cl)-c1ccc(cc1)C(=O)N1CCC[C@@H]1CN1CCCC1
InChI Key: InChIKey=MRXRQVJWPLAKHY-OAQYLSRUSA-N
Activity Spreadsheet -- Enzyme Inhibition Constant Data from BindingDB
Found 2 hits for monomerid = 50352531
Trg + Lig
Ki
nM
ΔG°
kcal/mole
IC50
nM
Kd
nM
EC50/IC50
nM
koff
s-1
kon
M-1s-1
pHTemp
°C
Hepatocyte growth factor receptor
(Homo sapiens (Human))
BDBM50352531
(CHEMBL1824875)
Show SMILES Nc1ncc(cc1OCc1c(F)ccc(F)c1Cl)-c1ccc(cc1)C(=O)N1CCC[C@@H]1CN1CCCC1 |r|
Show InChI InChI=1S/C28H29ClF2N4O2/c29-26-22(23(30)9-10-24(26)31)17-37-25-14-20(15-33-27(25)32)18-5-7-19(8-6-18)28(36)35-13-3-4-21(35)16-34-11-1-2-12-34/h5-10,14-15,21H,1-4,11-13,16-17H2,(H2,32,33)/t21-/m1/s1
880n/an/an/an/an/an/an/an/a
Pfizer Inc.
Curated by ChEMBL
Assay Description
Binding affinity to human recombinant c-MET assessed as inhibition of autophosphorylation by continuous fluorometric assay
J Med Chem 54: 6342-63 (2011)
Article DOI: 10.1021/jm2007613
BindingDB Entry DOI: 10.7270/Q2Q52Q09
Hepatocyte growth factor receptor
(Homo sapiens (Human))
BDBM50352531
(CHEMBL1824875)
Show SMILES Nc1ncc(cc1OCc1c(F)ccc(F)c1Cl)-c1ccc(cc1)C(=O)N1CCC[C@@H]1CN1CCCC1 |r|
Show InChI InChI=1S/C28H29ClF2N4O2/c29-26-22(23(30)9-10-24(26)31)17-37-25-14-20(15-33-27(25)32)18-5-7-19(8-6-18)28(36)35-13-3-4-21(35)16-34-11-1-2-12-34/h5-10,14-15,21H,1-4,11-13,16-17H2,(H2,32,33)/t21-/m1/s1
n/an/a 560n/an/an/an/an/an/a
Pfizer Inc.
Curated by ChEMBL
Assay Description
Inhibition of human recombinant c-MET kinase expressed in A549 cells assessed as inhibition of HGF-induced autophosphorylation by ELISA method
J Med Chem 54: 6342-63 (2011)
Article DOI: 10.1021/jm2007613
BindingDB Entry DOI: 10.7270/Q2Q52Q09