null
SMILES: CC(Oc1cc(cnc1N)-n1cccn1)c1c(Cl)ccc(F)c1Cl
InChI Key: InChIKey=MKDWOPYFYVHZCU-UHFFFAOYSA-N
Activity Spreadsheet -- Enzyme Inhibition Constant Data from BindingDB
Found 2 hits for monomerid = 50352543
Trg + Lig
Ki
nM
ΔG°
kcal/mole
IC50
nM
Kd
nM
EC50/IC50
nM
koff
s-1
kon
M-1s-1
pHTemp
°C
Hepatocyte growth factor receptor
(Homo sapiens (Human))
BDBM50352543
(CHEMBL1824887)
Show SMILES CC(Oc1cc(cnc1N)-n1cccn1)c1c(Cl)ccc(F)c1Cl
Show InChI InChI=1S/C16H13Cl2FN4O/c1-9(14-11(17)3-4-12(19)15(14)18)24-13-7-10(8-21-16(13)20)23-6-2-5-22-23/h2-9H,1H3,(H2,20,21)
n/an/a 2.64E+3n/an/an/an/an/an/a
Pfizer Inc.
Curated by ChEMBL
Assay Description
Inhibition of human recombinant c-MET kinase expressed in A549 cells assessed as inhibition of HGF-induced autophosphorylation by ELISA method
J Med Chem 54: 6342-63 (2011)
Article DOI: 10.1021/jm2007613
BindingDB Entry DOI: 10.7270/Q2Q52Q09
Hepatocyte growth factor receptor
(Homo sapiens (Human))
BDBM50352543
(CHEMBL1824887)
Show SMILES CC(Oc1cc(cnc1N)-n1cccn1)c1c(Cl)ccc(F)c1Cl
Show InChI InChI=1S/C16H13Cl2FN4O/c1-9(14-11(17)3-4-12(19)15(14)18)24-13-7-10(8-21-16(13)20)23-6-2-5-22-23/h2-9H,1H3,(H2,20,21)
3.19E+3n/an/an/an/an/an/an/an/a
Pfizer Inc.
Curated by ChEMBL
Assay Description
Binding affinity to human recombinant c-MET assessed as inhibition of autophosphorylation by continuous fluorometric assay
J Med Chem 54: 6342-63 (2011)
Article DOI: 10.1021/jm2007613
BindingDB Entry DOI: 10.7270/Q2Q52Q09