BDBM50352549 CHEMBL1824893
SMILES: CC(Oc1cc(cnc1N)-c1c(C)n[nH]c1C)c1c(Cl)ccc(F)c1Cl
InChI Key: InChIKey=IRXCSICESJPHTO-UHFFFAOYSA-N
Data: 1 KI  1 IC50
Activity Spreadsheet -- Enzyme Inhibition Constant Data from BindingDB
Found 2 hits for monomerid = 50352549
Trg + Lig
Ki
nM
ΔG°
kcal/mole
IC50
nM
Kd
nM
EC50/IC50
nM
koff
s-1
kon
M-1s-1
pHTemp
°C
Hepatocyte growth factor receptor
(Homo sapiens (Human))
BDBM50352549
(CHEMBL1824893)
Show SMILES CC(Oc1cc(cnc1N)-c1c(C)n[nH]c1C)c1c(Cl)ccc(F)c1Cl
Show InChI InChI=1S/C18H17Cl2FN4O/c1-8-15(9(2)25-24-8)11-6-14(18(22)23-7-11)26-10(3)16-12(19)4-5-13(21)17(16)20/h4-7,10H,1-3H3,(H2,22,23)(H,24,25)
230n/an/an/an/an/an/an/an/a
Pfizer Inc.
Curated by ChEMBL
Assay Description
Binding affinity to human recombinant c-MET assessed as inhibition of autophosphorylation by continuous fluorometric assay
J Med Chem 54: 6342-63 (2011)
Article DOI: 10.1021/jm2007613
BindingDB Entry DOI: 10.7270/Q2Q52Q09
Hepatocyte growth factor receptor
(Homo sapiens (Human))
BDBM50352549
(CHEMBL1824893)
Show SMILES CC(Oc1cc(cnc1N)-c1c(C)n[nH]c1C)c1c(Cl)ccc(F)c1Cl
Show InChI InChI=1S/C18H17Cl2FN4O/c1-8-15(9(2)25-24-8)11-6-14(18(22)23-7-11)26-10(3)16-12(19)4-5-13(21)17(16)20/h4-7,10H,1-3H3,(H2,22,23)(H,24,25)
n/an/a 333n/an/an/an/an/an/a
Pfizer Inc.
Curated by ChEMBL
Assay Description
Inhibition of human recombinant c-MET kinase expressed in A549 cells assessed as inhibition of HGF-induced autophosphorylation by ELISA method
J Med Chem 54: 6342-63 (2011)
Article DOI: 10.1021/jm2007613
BindingDB Entry DOI: 10.7270/Q2Q52Q09