BDBM50352552 CHEMBL1824895
SMILES: CC(Oc1cc(cnc1N)-c1cnn(c1)C(C)(C)C(=O)NCCN(C)C)c1c(Cl)ccc(F)c1Cl
InChI Key: InChIKey=NJNFJKUWAWYKBY-UHFFFAOYSA-N
Data: 1 KI  1 IC50
Activity Spreadsheet -- Enzyme Inhibition Constant Data from BindingDB
Found 2 hits for monomerid = 50352552
Trg + Lig
Ki
nM
ΔG°
kcal/mole
IC50
nM
Kd
nM
EC50/IC50
nM
koff
s-1
kon
M-1s-1
pHTemp
°C
Hepatocyte growth factor receptor
(Homo sapiens (Human))
BDBM50352552
(CHEMBL1824895)
Show SMILES CC(Oc1cc(cnc1N)-c1cnn(c1)C(C)(C)C(=O)NCCN(C)C)c1c(Cl)ccc(F)c1Cl
Show InChI InChI=1S/C24H29Cl2FN6O2/c1-14(20-17(25)6-7-18(27)21(20)26)35-19-10-15(11-30-22(19)28)16-12-31-33(13-16)24(2,3)23(34)29-8-9-32(4)5/h6-7,10-14H,8-9H2,1-5H3,(H2,28,30)(H,29,34)
60n/an/an/an/an/an/an/an/a
Pfizer Inc.
Curated by ChEMBL
Assay Description
Binding affinity to human recombinant c-MET assessed as inhibition of autophosphorylation by continuous fluorometric assay
J Med Chem 54: 6342-63 (2011)
Article DOI: 10.1021/jm2007613
BindingDB Entry DOI: 10.7270/Q2Q52Q09
Hepatocyte growth factor receptor
(Homo sapiens (Human))
BDBM50352552
(CHEMBL1824895)
Show SMILES CC(Oc1cc(cnc1N)-c1cnn(c1)C(C)(C)C(=O)NCCN(C)C)c1c(Cl)ccc(F)c1Cl
Show InChI InChI=1S/C24H29Cl2FN6O2/c1-14(20-17(25)6-7-18(27)21(20)26)35-19-10-15(11-30-22(19)28)16-12-31-33(13-16)24(2,3)23(34)29-8-9-32(4)5/h6-7,10-14H,8-9H2,1-5H3,(H2,28,30)(H,29,34)
n/an/a 65n/an/an/an/an/an/a
Pfizer Inc.
Curated by ChEMBL
Assay Description
Inhibition of human recombinant c-MET kinase expressed in A549 cells assessed as inhibition of HGF-induced autophosphorylation by ELISA method
J Med Chem 54: 6342-63 (2011)
Article DOI: 10.1021/jm2007613
BindingDB Entry DOI: 10.7270/Q2Q52Q09