BDBM50352553 CHEMBL1825130
SMILES: CC(Oc1cc(cnc1N)-c1cnn(CC(=O)NCCCN(C)C)c1)c1c(Cl)ccc(F)c1Cl
InChI Key: InChIKey=SVTVYRAZHFXLAP-UHFFFAOYSA-N
Data: 1 KI  1 IC50
Activity Spreadsheet -- Enzyme Inhibition Constant Data from BindingDB
Found 2 hits for monomerid = 50352553
Trg + Lig
Ki
nM
ΔG°
kcal/mole
IC50
nM
Kd
nM
EC50/IC50
nM
koff
s-1
kon
M-1s-1
pHTemp
°C
Hepatocyte growth factor receptor
(Homo sapiens (Human))
BDBM50352553
(CHEMBL1825130)
Show SMILES CC(Oc1cc(cnc1N)-c1cnn(CC(=O)NCCCN(C)C)c1)c1c(Cl)ccc(F)c1Cl
Show InChI InChI=1S/C23H27Cl2FN6O2/c1-14(21-17(24)5-6-18(26)22(21)25)34-19-9-15(10-29-23(19)27)16-11-30-32(12-16)13-20(33)28-7-4-8-31(2)3/h5-6,9-12,14H,4,7-8,13H2,1-3H3,(H2,27,29)(H,28,33)
49n/an/an/an/an/an/an/an/a
Pfizer Inc.
Curated by ChEMBL
Assay Description
Binding affinity to human recombinant c-MET assessed as inhibition of autophosphorylation by continuous fluorometric assay
J Med Chem 54: 6342-63 (2011)
Article DOI: 10.1021/jm2007613
BindingDB Entry DOI: 10.7270/Q2Q52Q09
Hepatocyte growth factor receptor
(Homo sapiens (Human))
BDBM50352553
(CHEMBL1825130)
Show SMILES CC(Oc1cc(cnc1N)-c1cnn(CC(=O)NCCCN(C)C)c1)c1c(Cl)ccc(F)c1Cl
Show InChI InChI=1S/C23H27Cl2FN6O2/c1-14(21-17(24)5-6-18(26)22(21)25)34-19-9-15(10-29-23(19)27)16-11-30-32(12-16)13-20(33)28-7-4-8-31(2)3/h5-6,9-12,14H,4,7-8,13H2,1-3H3,(H2,27,29)(H,28,33)
n/an/a 76n/an/an/an/an/an/a
Pfizer Inc.
Curated by ChEMBL
Assay Description
Inhibition of human recombinant c-MET kinase expressed in A549 cells assessed as inhibition of HGF-induced autophosphorylation by ELISA method
J Med Chem 54: 6342-63 (2011)
Article DOI: 10.1021/jm2007613
BindingDB Entry DOI: 10.7270/Q2Q52Q09