BDBM50352572 CHEMBL1825157::US8772288, 51
SMILES: Cc1ccc(cc1-c1cc2NC(=O)C3(CCCC3)c2cn1)C(=O)NC1CC1
InChI Key: InChIKey=GQMZOGFWLDFTKS-UHFFFAOYSA-N
Data: 3 IC50
Activity Spreadsheet -- Enzyme Inhibition Constant Data from BindingDB
Found 3 hits for monomerid = 50352572
Trg + Lig
Ki
nM
ΔG°
kcal/mole
IC50
nM
Kd
nM
EC50/IC50
nM
koff
s-1
kon
M-1s-1
pHTemp
°C
Mitogen-activated protein kinase 14
(Homo sapiens (Human))
BDBM50352572
(CHEMBL1825157 | US8772288, 51)
Show SMILES Cc1ccc(cc1-c1cc2NC(=O)C3(CCCC3)c2cn1)C(=O)NC1CC1
Show InChI InChI=1S/C22H23N3O2/c1-13-4-5-14(20(26)24-15-6-7-15)10-16(13)18-11-19-17(12-23-18)22(21(27)25-19)8-2-3-9-22/h4-5,10-12,15H,2-3,6-9H2,1H3,(H,24,26)(H,25,27)
NCI pathway
Reactome pathway
US Patent
n/an/a 0.800n/an/an/an/a7.525
Almirall, S.A.
US Patent
Assay Description
Enzymatic activity assay was performed in 96-well microtiter plates (Corning, catalog number #3686) using a total volume of 50 ul of an assay buffer ...
US Patent US8772288 (2014)
BindingDB Entry DOI: 10.7270/Q2T152BM
Mitogen-activated protein kinase 14
(Homo sapiens (Human))
BDBM50352572
(CHEMBL1825157 | US8772288, 51)
Show SMILES Cc1ccc(cc1-c1cc2NC(=O)C3(CCCC3)c2cn1)C(=O)NC1CC1
Show InChI InChI=1S/C22H23N3O2/c1-13-4-5-14(20(26)24-15-6-7-15)10-16(13)18-11-19-17(12-23-18)22(21(27)25-19)8-2-3-9-22/h4-5,10-12,15H,2-3,6-9H2,1H3,(H,24,26)(H,25,27)
NCI pathway
Reactome pathway
n/an/a 64n/an/an/an/an/an/a
Rhône-Poulenc Rorer
Curated by ChEMBL
Assay Description
Inhibition of p38alpha in human whole blood assessed as reduction in TNF-alpha production by ELISA
Bioorg Med Chem Lett 21: 5270-3 (2011)
Article DOI: 10.1016/j.bmcl.2011.07.033
BindingDB Entry DOI: 10.7270/Q2KD1Z8K
Mitogen-activated protein kinase 14
(Homo sapiens (Human))
BDBM50352572
(CHEMBL1825157 | US8772288, 51)
Show SMILES Cc1ccc(cc1-c1cc2NC(=O)C3(CCCC3)c2cn1)C(=O)NC1CC1
Show InChI InChI=1S/C22H23N3O2/c1-13-4-5-14(20(26)24-15-6-7-15)10-16(13)18-11-19-17(12-23-18)22(21(27)25-19)8-2-3-9-22/h4-5,10-12,15H,2-3,6-9H2,1H3,(H,24,26)(H,25,27)
NCI pathway
Reactome pathway
n/an/a 0.800n/an/an/an/an/an/a
Rhône-Poulenc Rorer
Curated by ChEMBL
Assay Description
Inhibition of human p38alpha using biotinylated ATF2 substrate by FRET assay
Bioorg Med Chem Lett 21: 5270-3 (2011)
Article DOI: 10.1016/j.bmcl.2011.07.033
BindingDB Entry DOI: 10.7270/Q2KD1Z8K