BDBM50352593 CHEMBL1825174
SMILES: CN1CCC[C@H]1CCn1ccc2cc(ccc12)N=C(N)c1cccs1
InChI Key: InChIKey=PRVOGTVRVMVUHG-KRWDZBQOSA-N
Data: 3 IC50
Activity Spreadsheet -- Enzyme Inhibition Constant Data from BindingDB
Found 3 hits for monomerid = 50352593
Trg + Lig
Ki
nM
ΔG°
kcal/mole
IC50
nM
Kd
nM
EC50/IC50
nM
koff
s-1
kon
M-1s-1
pHTemp
°C
Nitric oxide synthase, brain
(Homo sapiens (Human))
BDBM50352593
(CHEMBL1825174)
Show SMILES CN1CCC[C@H]1CCn1ccc2cc(ccc12)N=C(N)c1cccs1 |r,w:17.19|
Show InChI InChI=1S/C20H24N4S/c1-23-10-2-4-17(23)9-12-24-11-8-15-14-16(6-7-18(15)24)22-20(21)19-5-3-13-25-19/h3,5-8,11,13-14,17H,2,4,9-10,12H2,1H3,(H2,21,22)/t17-/m0/s1
Reactome pathway
n/an/a 20n/an/an/an/an/an/a
NeurAxon Inc.
Curated by ChEMBL
Assay Description
Inhibition of human recombinant nNOS expressed in Sf9 cells assessed as conversion of [3H]-L-arginine to [3H]-L-citrulline by radiometric method
Bioorg Med Chem Lett 21: 5301-4 (2011)
Article DOI: 10.1016/j.bmcl.2011.07.022
BindingDB Entry DOI: 10.7270/Q2FN16KP
Nitric oxide synthase, inducible
(Homo sapiens (Human))
BDBM50352593
(CHEMBL1825174)
Show SMILES CN1CCC[C@H]1CCn1ccc2cc(ccc12)N=C(N)c1cccs1 |r,w:17.19|
Show InChI InChI=1S/C20H24N4S/c1-23-10-2-4-17(23)9-12-24-11-8-15-14-16(6-7-18(15)24)22-20(21)19-5-3-13-25-19/h3,5-8,11,13-14,17H,2,4,9-10,12H2,1H3,(H2,21,22)/t17-/m0/s1
NCI pathway
Reactome pathway
n/an/a 1.70E+4n/an/an/an/an/an/a
NeurAxon Inc.
Curated by ChEMBL
Assay Description
Inhibition of human recombinant iNOS expressed in Sf9 cells assessed as conversion of [3H]-L-arginine to [3H]-L-citrulline by radiometric method
Bioorg Med Chem Lett 21: 5301-4 (2011)
Article DOI: 10.1016/j.bmcl.2011.07.022
BindingDB Entry DOI: 10.7270/Q2FN16KP
Nitric oxide synthase, endothelial
(Homo sapiens (Human))
BDBM50352593
(CHEMBL1825174)
Show SMILES CN1CCC[C@H]1CCn1ccc2cc(ccc12)N=C(N)c1cccs1 |r,w:17.19|
Show InChI InChI=1S/C20H24N4S/c1-23-10-2-4-17(23)9-12-24-11-8-15-14-16(6-7-18(15)24)22-20(21)19-5-3-13-25-19/h3,5-8,11,13-14,17H,2,4,9-10,12H2,1H3,(H2,21,22)/t17-/m0/s1
n/an/a 1.92E+3n/an/an/an/an/an/a
NeurAxon Inc.
Curated by ChEMBL
Assay Description
Inhibition of human recombinant eNOS expressed in Sf9 cells assessed as conversion of [3H]-L-arginine to [3H]-L-citrulline by radiometric method
Bioorg Med Chem Lett 21: 5301-4 (2011)
Article DOI: 10.1016/j.bmcl.2011.07.022
BindingDB Entry DOI: 10.7270/Q2FN16KP