BDBM50352635 CHEMBL1720902
SMILES: CC(C)Oc1cccc(c1)-c1ccnc(n1)N1CCC(CC1)C(N)=O
InChI Key: InChIKey=FEZHSOQGVVCFMF-UHFFFAOYSA-N
Data: 1 IC50
Activity Spreadsheet -- Enzyme Inhibition Constant Data from BindingDB
Found 1 hit for monomerid = 50352635
Trg + Lig
Ki
nM
ΔG°
kcal/mole
IC50
nM
Kd
nM
EC50/IC50
nM
koff
s-1
kon
M-1s-1
pHTemp
°C
Luciferase
(Luciola lateralis)
BDBM50352635
(CHEMBL1720902)
Show SMILES CC(C)Oc1cccc(c1)-c1ccnc(n1)N1CCC(CC1)C(N)=O
Show InChI InChI=1S/C19H24N4O2/c1-13(2)25-16-5-3-4-15(12-16)17-6-9-21-19(22-17)23-10-7-14(8-11-23)18(20)24/h3-6,9,12-14H,7-8,10-11H2,1-2H3,(H2,20,24)
n/an/a 1.00E+4n/an/an/an/an/an/a
National Human Genome Research Institute
Curated by ChEMBL
Assay Description
Inhibition of fire fly luciferase
J Med Chem 54: 6215-33 (2011)
Article DOI: 10.1021/jm200497t
BindingDB Entry DOI: 10.7270/Q22F7NVF