BDBM50353066 CHEMBL1822733
SMILES: CCCCN1C[C@@H](CO)O[C@@H](C1)OC
InChI Key: InChIKey=TWVWDPDWEOLLJL-UWVGGRQHSA-N
Data: 1 IC50
Activity Spreadsheet -- Enzyme Inhibition Constant Data from BindingDB
Found 1 hit for monomerid = 50353066
Trg + Lig
Ki
nM
ΔG°
kcal/mole
IC50
nM
Kd
nM
EC50/IC50
nM
koff
s-1
kon
M-1s-1
pHTemp
°C
β-galactosidase
(Bos taurus (Bovine))
BDBM50353066
(CHEMBL1822733)
Show SMILES CCCCN1C[C@@H](CO)O[C@@H](C1)OC |r|
Show InChI InChI=1S/C10H21NO3/c1-3-4-5-11-6-9(8-12)14-10(7-11)13-2/h9-10,12H,3-8H2,1-2H3/t9-,10-/m0/s1
n/an/a 7.03E+4n/an/an/an/an/an/a
University of Reading
Curated by ChEMBL
Assay Description
Inhibition of bovine kidney beta-D-galactosidase after 10 to 20 mins
Bioorg Med Chem 19: 5679-92 (2011)
Article DOI: 10.1016/j.bmc.2011.07.019
BindingDB Entry DOI: 10.7270/Q2QZ2BB5