BDBM50353110 CHEMBL1829122
SMILES: COc1ccc(CN2CCN(CCOc3ccc(cc3NC(=O)c3ccccc3[N+]([O-])=O)C(=O)NC(N)=N)CC2)c(OC)c1OC
InChI Key: InChIKey=YZVWKJMWZXLVFK-UHFFFAOYSA-N
Data: 1 IC50
Activity Spreadsheet -- Enzyme Inhibition Constant Data from BindingDB
Found 1 hit for monomerid = 50353110
Trg + Lig
Ki
nM
ΔG°
kcal/mole
IC50
nM
Kd
nM
EC50/IC50
nM
koff
s-1
kon
M-1s-1
pHTemp
°C
Sodium/hydrogen exchanger 1
(Rattus norvegicus)
BDBM50353110
(CHEMBL1829122)
Show SMILES COc1ccc(CN2CCN(CCOc3ccc(cc3NC(=O)c3ccccc3[N+]([O-])=O)C(=O)NC(N)=N)CC2)c(OC)c1OC
Show InChI InChI=1S/C31H37N7O8/c1-43-26-11-9-21(27(44-2)28(26)45-3)19-37-14-12-36(13-15-37)16-17-46-25-10-8-20(29(39)35-31(32)33)18-23(25)34-30(40)22-6-4-5-7-24(22)38(41)42/h4-11,18H,12-17,19H2,1-3H3,(H,34,40)(H4,32,33,35,39)
Reactome pathway
n/an/a 0.0730n/an/an/an/an/an/a
China Pharmaceutical University
Curated by ChEMBL
Assay Description
Inhibition of NHE1 in Sprague-Dawley rat assessed as inhibition of acid-induced platelet swelling by spectrophotometric analysis
Eur J Med Chem 46: 4107-16 (2011)
Article DOI: 10.1016/j.ejmech.2011.06.011
BindingDB Entry DOI: 10.7270/Q27081T0